{"text_format":"1","workbook":"xlsx","n_sheets":4,"sheets":["Portfolio","Charts","Settings","Exchanges"],"not_rendered":{"charts":0,"images":3,"macros":1,"external_links":0,"defined_names":11,"comments":0,"pivot_tables":0},"unopened":[],"bounds":{"document_bytes":16777216,"sheet_cells":100000,"rows_first":2000,"rows_last":500,"rows_between":2000,"halvings":0,"cell_chars":16384,"cell_head_chars":4096},"cells_cut":0,"cells_raw":0,"read":"whole","date_system":"1900"}

{"sheet":"Portfolio","index":0,"n_rows":511,"n_cols":50,"rows_kept":511,"cut":false,"hidden":false,"merged":[[1,8,1,9],[2,8,2,9],[3,8,3,9],[4,8,4,9],[5,8,5,9],[1,10,1,11],[2,10,2,11],[3,10,3,11],[4,10,4,11],[1,13,1,15],[2,13,2,14],[3,13,3,14],[4,13,4,14],[5,4,5,5],[6,4,6,5],[6,13,6,14],[8,9,8,12],[6,8,6,9],[6,10,6,11],[5,10,5,11],[5,13,5,14],[0,0,3,1],[1,4,1,5],[2,4,2,5],[3,4,3,5],[4,4,4,5],[4,0,4,1]]}
[null,null,null,null,null,{"$f":"IF($B2<>\"\",GetStockNumParam($B2,\"k\"),\"\")","v":""}]
[null,null,null,null,"Tot Cost of Positions",null,{"$f":"SUM(AF11:AF511)","v":127771.15299999999},null,"Book Value",null,{"$f":"SUM(AC11:AC511)","v":95454.022999999986},null,null,"Overall Position Record",null,null,null,null,null,null,null,null,null,null,null,null,null,null,null,null,null,"IN Position",null,null,null,null,null,null,null,null,null,"Description (currently sorted ascending) Sort By Description, Descending","Symbol (currently sorted ascending) Sort By Description, Descending","Transaction Date (currently sorted ascending) Sort By Description, Descending","Settlement Date (currently sorted ascending) Sort By Description, Descending","Account Currency (currently sorted ascending) Sort By Description, Descending","Type (currently sorted ascending) Sort By Description, Descending","Quantity","Price","Settlement Amount"]
[null,null,null,null,"Tot Value of Positions",null,{"$f":"SUM(AG11:AG511)+$B$9","v":117833.3913},null,"Market Value",null,{"$f":"SUM(AB11:AB511)+$B$9","v":85087.391300000003},null,null,"POSITIONS ENTERED",null,{"$f":"P4+P5+P6","v":8},null,null,null,null,null,null,null,null,null,null,null,null,null,null,null,"OUT Position",null,null,null,null,null,null,null,null,null,"conf#94290762 Scotia Online FEE CHARGE",null,"Mar. 25, 2015","Mar. 25, 2015","CAD","FEE",0,0,-50]
[null,null,null,null,"Tot Return Value",null,{"$f":"G3-G2","v":-9937.7616999999882},null,"Market Change ($)",null,{"$f":"SUM(K3-K2)","v":-10366.631699999984},null,null,"WINS",null,{"$f":"COUNTIF(AH11:AH511,\">0\")","v":5},null,null,null,null,null,null,null,null,null,null,null,null,null,null,null,"Watching",null,null,null,null,null,null,null,null,null,"conf#94290762 Scotia Online FEDERAL TAX",null,"Mar. 25, 2015","Mar. 25, 2015","CAD","TAX",0,0,-444.44]
["PREDICTOR STOCK QUOTE MANAGER",null,null,null,"Tot Return Rate",null,{"$f":"SUM(G7-B8) / B8","v":-9.9377616999999877E-2},null,"Market Change (%)",null,{"$f":"IF(ISERR((K3/K2)-100%),\"N/A\",(K3/K2)-100%)","v":-0.10860340270833824},null,null,"LOSSES",null,{"$f":"COUNTIF(AH11:AH511,\"<0\")","v":3},null,null,null,null,null,null,null,null,null,null,null,null,null,null,null,"Simulate",null,null,null,null,null,null,null,null,null,"conf#94290762 Scotia Online HST# R104752415",null,"Mar. 25, 2015","Mar. 25, 2015","CAD","HST",0,0,-7.5]
["My Country","Canada",null,null,"Tot Trade Fees",null,{"$f":"SUM(H11:H511)+SUM(V11:V511)","v":55.980000000000004},null,"Dividends Earned",null,{"$f":"SUM(W11:W511)","v":0},null,null,"TIES",null,{"$f":"COUNTIF(AH11:AH511,\"=0\")","v":0},null,null,null,null,null,null,null,null,null,null,null,null,null,null,null,null,null,null,null,null,null,null,null,null,null,"conf#94290762 Scotia Online WITHDRAWAL",null,"Mar. 25, 2015","Mar. 25, 2015","CAD","WITHDRAW",0,0,-4000]
["Starting Date","2015-07-06",null,null,"Account Value",null,{"$f":"SUM(G4+B8)","v":90062.238300000012},null,"Buying Power",null,{"$f":"G7-K3","v":4974.8470000000088},null,null,"TRADE AVERAGE",null,{"$f":"ROUND((P4/(P3-P6)),3)","v":0.625},null,null,null,null,null,null,null,null,null,null,null,null,null,null,null,"CAD",null,"Normal"]
["Cash Injection",100000,null,null,{"$f":"IF(B6 = \"Canada\", \"USDCAD X\",\"CADUSD X\")","v":"USDCAD X"},null,null,null,null,null,null,null,null,null,null,null,null,null,null,null,null,null,null,null,null,null,null,null,null,null,null,"USD",null,"Simulate"]
["Market Value Adjustment",0,null,null,{"$f":"GetXRate(B6)","v":1.3082},null,null,null,0,"Stock Quotes (yahoo financial - 20 min delay)"]
["Stock Name","Position","Symbol","Qty","Currency","Purchase Price Per Share","Transaction Date","Trade Fees","Total Cost (Purchase Price + Fees)","\nPrv Close Quote","\nCurrent Quote","Day\nGain\nLoss","Day\nRet\n(%)","Market\nValue","Gain/Loss ($)","Gain/Loss (%)","Alert\nSell","Alert\nStop","Alert\nAction","Sold Price","Sold Date","Trade\nFees","Dividend\nPaid","Actual \nReturn \nGain ($)","Actual \nReturn \n(%)","End Value"]
[{"$f":"IF($C11=\"\",\"\",GetName($C11))","v":"Walt Disney Company (The) Commo\n"},"IN Position","DIS",100,"USD",117.15,"2015-07-10",0,15284.5605,144.29445999999999,143.14324400000001,{"$f":"IF(J11 > 0,K11-J11,\"\")","v":-1.1512159999999767},{"$f":"IF(J11 > 0,(L11/J11),\"\")","v":-7.9782411604712809E-3},{"$f":"IF(D11 > 0,IF(T11 > 0,\"SOLD\",D11*K11),\"\")","v":14314.324400000001},{"$f":"IF(D11 > 0,IF(T11 > 0, Z11-I11, N11-I11),\"\")","v":-970.23609999999826},{"$f":"IF(D11 > 0,IF(O11=0,0,(O11/I11)),\"\")","v":-6.3478181135793746E-2},{"$f":"IFERROR(IF($F11>0,IF($B$6=\"Canada\",IF($E11=\"CAD\",$F11*((Settings!$B$2)+1),$F11*$E$9*((Settings!$B$2)+1)), IF($E11=\"USD\",$F11*((Settings!$B$2)+1),$F11*$E$9*((Settings!$B$2)+1))),””),\"\")","v":183.90675600000003},{"$f":"IFERROR(IF($F11>0,$AA11*(1-Settings!$B$3),\"\"),\"\")","v":147.12540480000001},{"$f":"IF(F11>0,IF(K11>=Q11,\"SELL\",IF(K11<=R11,\"STOP\",\"HOLD\")),\"\")","v":"STOP"},null,null,null,null,{"$f":"IF(D11 > 0,IF(Z11 = 0,0,Z11-I11),\"\")","v":-970.23609999999826},{"$f":"IF(D11 > 0,IF(Z11=0,0,(Z11/I11)-100%),\"\")","v":-6.3478181135793732E-2},{"$f":"IF(T11 > 0,T11*D11-V11+W11,N11)","v":14314.324400000001},{"$f":"IF($B$6=\"Canada\",\nIF($E11=\"CAD\",IF($F11>$K11,$F11,$K11),IF(($F11*$E$9)>$K11,($F11*$E$9),$K11)),\nIF($E11=\"CAD\",IF(($F11*$E$9)>$K11,($F11*$E$9),$K11),IF($F11>$K11,$F11,$K11)))","v":153.25563000000002},{"$f":"IF($B11=\"Simulate\",0,IF(N11 = \"SOLD\", 0, N11))","v":14314.324400000001},{"$f":"IF($B11=\"Simulate\",0,IF(N11 = \"SOLD\",0,I11))","v":15284.5605},{"$f":"IF(N11 = \"SOLD\", Z11-I11,I11)","v":15284.5605},{"$f":"IF($C11<>\"\",GetStockNumParam($C11,\"h\"),\"\")","v":110.15},{"$f":"IF($B11=\"Simulate\",0,$I11)","v":15284.5605},{"$f":"IF($B11=\"Simulate\",0,Z11)","v":14314.324400000001},{"$f":"IF($B11=\"Simulate\",\"\",$O11)","v":-970.23609999999826}]
[{"$f":"IF($C12=\"\",\"\",GetName($C12))","v":"iShares Nasdaq Biotechnology In\n"},"IN Position","IBB",100,"USD",374.4,"2015-07-03",0,48847.967999999993,370.28601000000003,370.90086400000001,{"$f":"IF(J12 > 0,K12-J12,\"\")","v":0.61485399999997981},{"$f":"IF(J12 > 0,(L12/J12),\"\")","v":1.6604840134251352E-3},37090.0864,-11757.881599999993,-0.24070359692341747,{"$f":"IFERROR(IF($F12>0,IF($B$6=\"Canada\",IF($E12=\"CAD\",$F12*((Settings!$B$2)+1),$F12*$E$9*((Settings!$B$2)+1)), IF($E12=\"USD\",$F12*((Settings!$B$2)+1),$F12*$E$9*((Settings!$B$2)+1))),””),\"\")","v":587.74809599999992},{"$f":"IFERROR(IF($F12>0,$AA12*(1-Settings!$B$3),\"\"),\"\")","v":470.19847679999998},"STOP",null,null,null,null,-11757.881599999993,-0.24070359692341747,37090.0864,489.79007999999999,{"$f":"IF($B12=\"Simulate\",0,IF(N12 = \"SOLD\", 0, N12))","v":37090.0864},{"$f":"IF($B12=\"Simulate\",0,IF(N12 = \"SOLD\",0,I12))","v":48847.967999999993},48847.967999999993,{"$f":"IF($C12<>\"\",GetStockNumParam($C12,\"h\"),\"\")","v":283.70999999999998},{"$f":"IF($B12=\"Simulate\",0,$I12)","v":48847.967999999993},{"$f":"IF($B12=\"Simulate\",0,Z12)","v":37090.0864},{"$f":"IF($B12=\"Simulate\",\"\",$O12)","v":-11757.881599999993}]
["BMO EQUAL WEIGHT US BANK IDX ET\n","IN Position","ZBK.TO",500,"CAD",20.03,"2015-07-15",9.99,10024.99,24.09,24.14,5.0000000000000711E-2,2.0755500207555299E-3,12070,2045.0100000000002,0.20399122592640992,{"$f":"IFERROR(IF($F13>0,IF($B$6=\"Canada\",IF($E13=\"CAD\",$F13*((Settings!$B$2)+1),$F13*$E$9*((Settings!$B$2)+1)), IF($E13=\"USD\",$F13*((Settings!$B$2)+1),$F13*$E$9*((Settings!$B$2)+1))),””),\"\")","v":24.036000000000001},{"$f":"IFERROR(IF($F13>0,$AA13*(1-Settings!$B$3),\"\"),\"\")","v":23.174399999999999},"SELL",null,null,null,null,2045.0100000000002,0.20399122592640984,12070,24.14,12070,10024.99,10024.99,{"$f":"IF($C13<>\"\",GetStockNumParam($C13,\"h\"),\"\")","v":24.35},10024.99,12070,2045.0100000000002]
["Bank of America Corporation Com\n","IN Position","BAC",500,"USD",17.670000000000002,"2015-07-15",9,11536.024500000001,30.467977999999999,30.225961000000002,-0.24201699999999704,-7.9433233147272533E-3,15112.980500000001,3576.9560000000001,0.31006834286803048,{"$f":"IFERROR(IF($F14>0,IF($B$6=\"Canada\",IF($E14=\"CAD\",$F14*((Settings!$B$2)+1),$F14*$E$9*((Settings!$B$2)+1)), IF($E14=\"USD\",$F14*((Settings!$B$2)+1),$F14*$E$9*((Settings!$B$2)+1))),””),\"\")","v":27.739072800000006},{"$f":"IFERROR(IF($F14>0,$AA14*(1-Settings!$B$3),\"\"),\"\")","v":29.016922560000001},"SELL",null,null,null,null,3576.9560000000001,0.31006834286803042,15112.980500000001,30.225961000000002,15112.980500000001,11536.024500000001,11536.024500000001,{"$f":"IF($C14<>\"\",GetStockNumParam($C14,\"h\"),\"\")","v":23.38},11536.024500000001,15112.980500000001,3576.9560000000001]
["ELEMENT FLEET MANAGEMENT CORP\n","IN Position","EFN.TO",500,"CAD",19.64,"2015-07-15",9,9760.48,12.75,13,0.25,1.9607843137254902E-2,6500,-3260.4799999999996,-0.33404914512401024,{"$f":"IFERROR(IF($F15>0,IF($B$6=\"Canada\",IF($E15=\"CAD\",$F15*((Settings!$B$2)+1),$F15*$E$9*((Settings!$B$2)+1)), IF($E15=\"USD\",$F15*((Settings!$B$2)+1),$F15*$E$9*((Settings!$B$2)+1))),””),\"\")","v":23.568000000000001},{"$f":"IFERROR(IF($F15>0,$AA15*(1-Settings!$B$3),\"\"),\"\")","v":18.854399999999998},"STOP",null,null,null,null,-3260.4799999999996,-0.33404914512401029,6500,19.64,6500,9760.48,9760.48,{"$f":"IF($C15<>\"\",GetStockNumParam($C15,\"h\"),\"\")","v":13.04},9760.48,6500,-3260.4799999999996]
["",null,null,null,null,null,null,null,null,null,null,"","","","","",{"$f":"IFERROR(IF($F16>0,IF($B$6=\"Canada\",IF($E16=\"CAD\",$F16*((Settings!$B$2)+1),$F16*$E$9*((Settings!$B$2)+1)), IF($E16=\"USD\",$F16*((Settings!$B$2)+1),$F16*$E$9*((Settings!$B$2)+1))),””),\"\")","v":""},{"$f":"IFERROR(IF($F16>0,$AA16*(1-Settings!$B$3),\"\"),\"\")","v":""},"",null,null,null,null,"","","",0,"",0,0,{"$f":"IF($C16<>\"\",GetStockNumParam($C16,\"h\"),\"\")","v":""},0,"",""]
["",null,null,null,null,null,null,null,null,null,null,"","","","","",{"$f":"IFERROR(IF($F17>0,IF($B$6=\"Canada\",IF($E17=\"CAD\",$F17*((Settings!$B$2)+1),$F17*$E$9*((Settings!$B$2)+1)), IF($E17=\"USD\",$F17*((Settings!$B$2)+1),$F17*$E$9*((Settings!$B$2)+1))),””),\"\")","v":""},{"$f":"IFERROR(IF($F17>0,$AA17*(1-Settings!$B$3),\"\"),\"\")","v":""},"",null,null,null,null,"","",{"$f":"IF(T17 > 0,T17*D17-V17+W17,N17)","v":""},0,"",0,0,{"$f":"IF($C17<>\"\",GetStockNumParam($C17,\"h\"),\"\")","v":""},0,"",""]
["CRESCENT POINT ENERGY CORP.\n","Watching","CPG.TO",0,"CAD",null,null,null,null,14.79,14.05,-0.73999999999999844,-5.0033806626098611E-2,"","","",{"$f":"IFERROR(IF($F18>0,IF($B$6=\"Canada\",IF($E18=\"CAD\",$F18*((Settings!$B$2)+1),$F18*$E$9*((Settings!$B$2)+1)), IF($E18=\"USD\",$F18*((Settings!$B$2)+1),$F18*$E$9*((Settings!$B$2)+1))),””),\"\")","v":""},{"$f":"IFERROR(IF($F18>0,$AA18*(1-Settings!$B$3),\"\"),\"\")","v":""},"",null,null,null,null,"","","",14.05,"",0,0,{"$f":"IF($C18<>\"\",GetStockNumParam($C18,\"h\"),\"\")","v":14.94},0,"",""]
["DH CORPORATION\n","Watching","DH.TO",0,"CAD",null,null,null,null,23.67,23.72,4.9999999999997158E-2,2.1123785382339312E-3,"","","",{"$f":"IFERROR(IF($F19>0,IF($B$6=\"Canada\",IF($E19=\"CAD\",$F19*((Settings!$B$2)+1),$F19*$E$9*((Settings!$B$2)+1)), IF($E19=\"USD\",$F19*((Settings!$B$2)+1),$F19*$E$9*((Settings!$B$2)+1))),””),\"\")","v":""},{"$f":"IFERROR(IF($F19>0,$AA19*(1-Settings!$B$3),\"\"),\"\")","v":""},"",null,null,null,null,"","","",23.72,"",0,0,{"$f":"IF($C19<>\"\",GetStockNumParam($C19,\"h\"),\"\")","v":23.92},0,"",""]
["FAIRFAX INDIA HOLDINGS CORPORAT\n","Watching","FIH-U.TO",0,"CAD",null,null,null,null,11.44,11.65,0.21000000000000085,1.8356643356643432E-2,"","","",{"$f":"IFERROR(IF($F20>0,IF($B$6=\"Canada\",IF($E20=\"CAD\",$F20*((Settings!$B$2)+1),$F20*$E$9*((Settings!$B$2)+1)), IF($E20=\"USD\",$F20*((Settings!$B$2)+1),$F20*$E$9*((Settings!$B$2)+1))),””),\"\")","v":""},{"$f":"IFERROR(IF($F20>0,$AA20*(1-Settings!$B$3),\"\"),\"\")","v":""},"",null,null,null,null,"","","",11.65,"",0,0,{"$f":"IF($C20<>\"\",GetStockNumParam($C20,\"h\"),\"\")","v":11.69},0,"",""]
{"$rows_left_out":492}
{"sheet":"Charts","index":1,"n_rows":511,"n_cols":10,"rows_kept":511,"cut":false,"hidden":false,"merged":[[0,2,0,6],[0,8,0,9]]}
["Investment Name","Stock Symbol","Display Yahoo Finance Charts in WebPage",null,null,null,null,"StockCharts","Yahoo Finance Quote Info"]
[{"$f":"GetName($B2)","v":"Walt Disney Company (The) Commo\n"},{"$f":"IF(Portfolio!C11=0,\"\",Portfolio!C11)","v":"DIS"},{"$f":"IF($B2<>\"\",HYPERLINK(\"http://ichart.finance.yahoo.com/c/3m/\"&$B2&\"?1234\",\"3m\"),\"\")","v":"3m"},{"$f":"IF($B2<>\"\",HYPERLINK(\"http://ichart.finance.yahoo.com/c/6m/\"&$B2&\"?1234\",\"6m\"),\"\")","v":"6m"},{"$f":"IF($B2<>\"\",HYPERLINK(\"http://ichart.finance.yahoo.com/c/1y/\"&$B2&\"?1234\",\"1y\"),\"\")","v":"1y"},{"$f":"IF($B2<>\"\",HYPERLINK(\"http://ichart.finance.yahoo.com/c/2y/\"&$B2&\"?1234\",\"2y\"),\"\")","v":"2y"},{"$f":"IF($B2<>\"\",HYPERLINK(\"http://ichart.finance.yahoo.com/c/5y/\"&$B2&\"?1234\",\"5y\"),\"\")","v":"5y"},{"$f":"IF($B2<>\"\",HYPERLINK(\"http://stockcharts.com/h-sc/ui?s=\"&$B2,\"6m\"),\"\")","v":"6m"},{"$f":"IF($B2<>\"\",HYPERLINK(\"http://finance.yahoo.com/q?s=\"&$B2&\"&ql=0\", \"News\"),\"\")","v":"News"},{"$f":"IF($B2<>\"\",HYPERLINK(\"http://finance.yahoo.com/q/ks?s=\"&$B2&\"+Key+Statistics\",\"Key Stats\"),\"\")","v":"Key Stats"}]
[{"$f":"GetName($B3)","v":"iShares Nasdaq Biotechnology In\n"},{"$f":"IF(Portfolio!C12=0,\"\",Portfolio!C12)","v":"IBB"},{"$f":"IF($B3<>\"\",HYPERLINK(\"http://ichart.finance.yahoo.com/c/3m/\"&$B3&\"?1234\",\"3m\"),\"\")","v":"3m"},{"$f":"IF($B3<>\"\",HYPERLINK(\"http://ichart.finance.yahoo.com/c/6m/\"&$B3&\"?1234\",\"6m\"),\"\")","v":"6m"},{"$f":"IF($B3<>\"\",HYPERLINK(\"http://ichart.finance.yahoo.com/c/1y/\"&$B3&\"?1234\",\"1y\"),\"\")","v":"1y"},{"$f":"IF($B3<>\"\",HYPERLINK(\"http://ichart.finance.yahoo.com/c/2y/\"&$B3&\"?1234\",\"2y\"),\"\")","v":"2y"},{"$f":"IF($B3<>\"\",HYPERLINK(\"http://ichart.finance.yahoo.com/c/5y/\"&$B3&\"?1234\",\"5y\"),\"\")","v":"5y"},{"$f":"IF($B3<>\"\",HYPERLINK(\"http://stockcharts.com/h-sc/ui?s=\"&$B3,\"6m\"),\"\")","v":"6m"},{"$f":"IF($B3<>\"\",HYPERLINK(\"http://finance.yahoo.com/q?s=\"&$B3&\"&ql=0\", \"News\"),\"\")","v":"News"},{"$f":"IF($B3<>\"\",HYPERLINK(\"http://finance.yahoo.com/q/ks?s=\"&$B3&\"+Key+Statistics\",\"Key Stats\"),\"\")","v":"Key Stats"}]
["BMO EQUAL WEIGHT US BANK IDX ET\n",{"$f":"IF(Portfolio!C13=0,\"\",Portfolio!C13)","v":"ZBK.TO"},"3m","6m","1y","2y","5y","6m","News","Key Stats"]
["Bank of America Corporation Com\n",{"$f":"IF(Portfolio!C14=0,\"\",Portfolio!C14)","v":"BAC"},"3m","6m","1y","2y","5y","6m","News","Key Stats"]
["ELEMENT FLEET MANAGEMENT CORP\n",{"$f":"IF(Portfolio!C15=0,\"\",Portfolio!C15)","v":"EFN.TO"},"3m","6m","1y","2y","5y","6m","News","Key Stats"]
["\n",{"$f":"IF(Portfolio!C16=0,\"\",Portfolio!C16)","v":""},"","","","","","","",""]
["\n",{"$f":"IF(Portfolio!C17=0,\"\",Portfolio!C17)","v":""},"","","","","","","",""]
["CRESCENT POINT ENERGY CORP.\n",{"$f":"IF(Portfolio!C18=0,\"\",Portfolio!C18)","v":"CPG.TO"},"3m","6m","1y","2y","5y","6m","News","Key Stats"]
["DH CORPORATION\n",{"$f":"IF(Portfolio!C19=0,\"\",Portfolio!C19)","v":"DH.TO"},"3m","6m","1y","2y","5y","6m","News","Key Stats"]
["FAIRFAX INDIA HOLDINGS CORPORAT\n",{"$f":"IF(Portfolio!C20=0,\"\",Portfolio!C20)","v":"FIH-U.TO"},"3m","6m","1y","2y","5y","6m","News","Key Stats"]
["Walt Disney Company (The) Commo\n",{"$f":"IF(Portfolio!C21=0,\"\",Portfolio!C21)","v":"DIS"},"3m","6m","1y","2y","5y","6m","News","Key Stats"]
["iShares Nasdaq Biotechnology In\n",{"$f":"IF(Portfolio!C22=0,\"\",Portfolio!C22)","v":"IBB"},"3m","6m","1y","2y","5y","6m","News","Key Stats"]
["BMO EQUAL WEIGHT US BANK IDX ET\n",{"$f":"IF(Portfolio!C23=0,\"\",Portfolio!C23)","v":"ZBK.TO"},"3m","6m","1y","2y","5y","6m","News","Key Stats"]
["Bank of America Corporation Com\n",{"$f":"IF(Portfolio!C24=0,\"\",Portfolio!C24)","v":"BAC"},"3m","6m","1y","2y","5y","6m","News","Key Stats"]
["ELEMENT FLEET MANAGEMENT CORP\n",{"$f":"IF(Portfolio!C25=0,\"\",Portfolio!C25)","v":"EFN.TO"},"3m","6m","1y","2y","5y","6m","News","Key Stats"]
["\n",{"$f":"IF(Portfolio!C26=0,\"\",Portfolio!C26)","v":""},"","","","","","","",""]
["BMO EQUAL WEIGHT US BANK IDX ET\n",{"$f":"IF(Portfolio!C27=0,\"\",Portfolio!C27)","v":"ZBK.TO"},"3m","6m","1y","2y","5y","6m","News","Key Stats"]
["BMO EQL WGT US HCARE HDGD TO CA\n",{"$f":"IF(Portfolio!C28=0,\"\",Portfolio!C28)","v":"ZUH.TO"},"3m","6m","1y","2y","5y","6m","News","Key Stats"]
["ELEMENT FLEET MANAGEMENT CORP\n",{"$f":"IF(Portfolio!C29=0,\"\",Portfolio!C29)","v":"EFN.TO"},"3m","6m","1y","2y","5y","6m","News","Key Stats"]
{"$rows_left_out":492}
{"sheet":"Settings","index":2,"n_rows":3,"n_cols":2,"rows_kept":3,"cut":false,"hidden":false,"merged":[[0,0,0,1]]}
["Formula Variable Settings"]
["Alert SELL Percentage Gain Limit",0.2]
["Alert STOP Trailing Percentage Loss Limit",0.04]

{"sheet":"Exchanges","index":3,"n_rows":159,"n_cols":5,"rows_kept":159,"cut":false,"hidden":false,"merged":[[69,0,69,2]]}
["Exchanges and Yahoo"]
[]
["Add the listed Suffix to your symbol name to get a quote from a specific exchange (N/A means no suffix)"]
[]
["Country","Exchange","Suffix","Delay","Data Provider"]
["United States of America","American Stock Exchange","N/A","15 min","Direct from Exchange"]
["United States of America","BATS Exchange","N/A","Real-time","Direct from Exchange"]
["United States of America","Chicago Board of Trade",".CBT","10 min","Interactive Data Real-Time Services"]
["United States of America","Chicago Mercantile Exchange",".CME","10 min","Interactive Data Real-Time Services"]
["United States of America","Dow Jones Indexes","N/A","Real-time","Interactive Data Real-Time Services"]
["United States of America","NASDAQ Stock Exchange","N/A","15 min","Direct from Exchange"]
["United States of America","New York Board of Trade",".NYB","30 min","Interactive Data Real-Time Services"]
["United States of America","New York Commodities Exchange",".CMX","30 min","Interactive Data Real-Time Services"]
["United States of America","New York Mercantile Exchange",".NYM","30 min","Interactive Data Real-Time Services"]
["United States of America","New York Stock Exchange","N/A","15 min","Direct from Exchange"]
["United States of America","OTC Bulletin Board Market",".OB","20 min","Direct from Exchange"]
["United States of America","Pink Sheets",".PK","15 min","Direct from Exchange"]
["United States of America","S & P Indices","N/A","Real-time","Interactive Data Real-Time Services"]
["Argentina","Buenos Aires Stock Exchange",".BA","30 min","Interactive Data Real-Time Services"]
["Austria","Vienna Stock Exchange",".VI","15 min","Telekurs"]
{"$rows_left_out":139}