{"text_format":"1","workbook":"xlsx","n_sheets":4,"sheets":["Portfolio","Charts","Settings","Exchanges"],"not_rendered":{"charts":0,"images":3,"macros":1,"external_links":0,"defined_names":11,"comments":0,"pivot_tables":0},"unopened":[],"bounds":{"document_bytes":16777216,"sheet_cells":100000,"rows_first":2000,"rows_last":500,"rows_between":2000,"halvings":0,"cell_chars":16384,"cell_head_chars":4096},"cells_cut":0,"cells_raw":0,"read":"whole","date_system":"1900"}

{"sheet":"Portfolio","index":0,"n_rows":511,"n_cols":50,"rows_kept":511,"cut":false,"hidden":false,"merged":[[1,8,1,9],[2,8,2,9],[3,8,3,9],[4,8,4,9],[5,8,5,9],[1,10,1,11],[2,10,2,11],[3,10,3,11],[4,10,4,11],[1,13,1,15],[2,13,2,14],[3,13,3,14],[4,13,4,14],[5,4,5,5],[6,4,6,5],[6,13,6,14],[8,9,8,12],[6,8,6,9],[6,10,6,11],[5,10,5,11],[5,13,5,14],[0,0,3,1],[1,4,1,5],[2,4,2,5],[3,4,3,5],[4,4,4,5],[4,0,4,1]]}
[null,null,null,null,null,{"$f":"IF($B2<>\"\",GetStockNumParam($B2,\"k\"),\"\")","v":""}]
[null,null,null,null,"Tot Cost of Positions",null,{"$f":"SUM(AF11:AF511)","v":127771.15299999999},null,"Book Value",null,{"$f":"SUM(AC11:AC511)","v":95454.022999999986},null,null,"Overall Position Record",null,null,null,null,null,null,null,null,null,null,null,null,null,null,null,null,null,"IN Position",null,null,null,null,null,null,null,null,null,"Description (currently sorted ascending) Sort By Description, Descending","Symbol (currently sorted ascending) Sort By Description, Descending","Transaction Date (currently sorted ascending) Sort By Description, Descending","Settlement Date (currently sorted ascending) Sort By Description, Descending","Account Currency (currently sorted ascending) Sort By Description, Descending","Type (currently sorted ascending) Sort By Description, Descending","Quantity","Price","Settlement Amount"]
[null,null,null,null,"Tot Value of Positions",null,{"$f":"SUM(AG11:AG511)+$B$9","v":117833.3913},null,"Market Value",null,{"$f":"SUM(AB11:AB511)+$B$9","v":85087.391300000003},null,null,"POSITIONS ENTERED",null,{"$f":"P4+P5+P6","v":8},null,null,null,null,null,null,null,null,null,null,null,null,null,null,null,"OUT Position",null,null,null,null,null,null,null,null,null,"conf#94290762 Scotia Online FEE CHARGE",null,"Mar. 25, 2015","Mar. 25, 2015","CAD","FEE",0,0,-50]
[null,null,null,null,"Tot Return Value",null,{"$f":"G3-G2","v":-9937.7616999999882},null,"Market Change ($)",null,{"$f":"SUM(K3-K2)","v":-10366.631699999984},null,null,"WINS",null,{"$f":"COUNTIF(AH11:AH511,\">0\")","v":5},null,null,null,null,null,null,null,null,null,null,null,null,null,null,null,"Watching",null,null,null,null,null,null,null,null,null,"conf#94290762 Scotia Online FEDERAL TAX",null,"Mar. 25, 2015","Mar. 25, 2015","CAD","TAX",0,0,-444.44]
["PREDICTOR STOCK QUOTE MANAGER",null,null,null,"Tot Return Rate",null,{"$f":"SUM(G7-B8) / B8","v":-9.9377616999999877E-2},null,"Market Change (%)",null,{"$f":"IF(ISERR((K3/K2)-100%),\"N/A\",(K3/K2)-100%)","v":-0.10860340270833824},null,null,"LOSSES",null,{"$f":"COUNTIF(AH11:AH511,\"<0\")","v":3},null,null,null,null,null,null,null,null,null,null,null,null,null,null,null,"Simulate",null,null,null,null,null,null,null,null,null,"conf#94290762 Scotia Online HST# R104752415",null,"Mar. 25, 2015","Mar. 25, 2015","CAD","HST",0,0,-7.5]
["My Country","Canada",null,null,"Tot Trade Fees",null,{"$f":"SUM(H11:H511)+SUM(V11:V511)","v":55.980000000000004},null,"Dividends Earned",null,{"$f":"SUM(W11:W511)","v":0},null,null,"TIES",null,{"$f":"COUNTIF(AH11:AH511,\"=0\")","v":0},null,null,null,null,null,null,null,null,null,null,null,null,null,null,null,null,null,null,null,null,null,null,null,null,null,"conf#94290762 Scotia Online WITHDRAWAL",null,"Mar. 25, 2015","Mar. 25, 2015","CAD","WITHDRAW",0,0,-4000]
["Starting Date","2015-07-06",null,null,"Account Value",null,{"$f":"SUM(G4+B8)","v":90062.238300000012},null,"Buying Power",null,{"$f":"G7-K3","v":4974.8470000000088},null,null,"TRADE AVERAGE",null,{"$f":"ROUND((P4/(P3-P6)),3)","v":0.625},null,null,null,null,null,null,null,null,null,null,null,null,null,null,null,"CAD",null,"Normal"]
["Cash Injection",100000,null,null,{"$f":"IF(B6 = \"Canada\", \"USDCAD X\",\"CADUSD X\")","v":"USDCAD X"},null,null,null,null,null,null,null,null,null,null,null,null,null,null,null,null,null,null,null,null,null,null,null,null,null,null,"USD",null,"Simulate"]
["Market Value Adjustment",0,null,null,{"$f":"GetXRate(B6)","v":1.3082},null,null,null,0,"Stock Quotes (yahoo financial - 20 min delay)"]
["Stock Name","Position","Symbol","Qty","Currency","Purchase Price Per Share","Transaction Date","Trade Fees","Total Cost (Purchase Price + Fees)","\nPrv Close Quote","\nCurrent Quote","Day\nGain\nLoss","Day\nRet\n(%)","Market\nValue","Gain/Loss ($)","Gain/Loss (%)","Alert\nSell","Alert\nStop","Alert\nAction","Sold Price","Sold Date","Trade\nFees","Dividend\nPaid","Actual \nReturn \nGain ($)","Actual \nReturn \n(%)","End Value"]
[{"$f":"IF($C11=\"\",\"\",GetName($C11))","v":"Walt Disney Company (The) Commo\n"},"IN Position","DIS",100,"USD",117.15,"2015-07-10",0,15284.5605,144.29445999999999,143.14324400000001,{"$f":"IF(J11 > 0,K11-J11,\"\")","v":-1.1512159999999767},{"$f":"IF(J11 > 0,(L11/J11),\"\")","v":-7.9782411604712809E-3},{"$f":"IF(D11 > 0,IF(T11 > 0,\"SOLD\",D11*K11),\"\")","v":14314.324400000001},{"$f":"IF(D11 > 0,IF(T11 > 0, Z11-I11, N11-I11),\"\")","v":-970.23609999999826},{"$f":"IF(D11 > 0,IF(O11=0,0,(O11/I11)),\"\")","v":-6.3478181135793746E-2},{"$f":"IFERROR(IF($F11>0,IF($B$6=\"Canada\",IF($E11=\"CAD\",$F11*((Settings!$B$2)+1),$F11*$E$9*((Settings!$B$2)+1)), IF($E11=\"USD\",$F11*((Settings!$B$2)+1),$F11*$E$9*((Settings!$B$2)+1))),””),\"\")","v":183.90675600000003},{"$f":"IFERROR(IF($F11>0,$AA11*(1-Settings!$B$3),\"\"),\"\")","v":147.12540480000001},{"$f":"IF(F11>0,IF(K11>=Q11,\"SELL\",IF(K11<=R11,\"STOP\",\"HOLD\")),\"\")","v":"STOP"},null,null,null,null,{"$f":"IF(D11 > 0,IF(Z11 = 0,0,Z11-I11),\"\")","v":-970.23609999999826},{"$f":"IF(D11 > 0,IF(Z11=0,0,(Z11/I11)-100%),\"\")","v":-6.3478181135793732E-2},{"$f":"IF(T11 > 0,T11*D11-V11+W11,N11)","v":14314.324400000001},{"$f":"IF($B$6=\"Canada\",\nIF($E11=\"CAD\",IF($F11>$K11,$F11,$K11),IF(($F11*$E$9)>$K11,($F11*$E$9),$K11)),\nIF($E11=\"CAD\",IF(($F11*$E$9)>$K11,($F11*$E$9),$K11),IF($F11>$K11,$F11,$K11)))","v":153.25563000000002},{"$f":"IF($B11=\"Simulate\",0,IF(N11 = \"SOLD\", 0, N11))","v":14314.324400000001},{"$f":"IF($B11=\"Simulate\",0,IF(N11 = \"SOLD\",0,I11))","v":15284.5605},{"$f":"IF(N11 = \"SOLD\", Z11-I11,I11)","v":15284.5605},{"$f":"IF($C11<>\"\",GetStockNumParam($C11,\"h\"),\"\")","v":110.15},{"$f":"IF($B11=\"Simulate\",0,$I11)","v":15284.5605},{"$f":"IF($B11=\"Simulate\",0,Z11)","v":14314.324400000001},{"$f":"IF($B11=\"Simulate\",\"\",$O11)","v":-970.23609999999826}]
[{"$f":"IF($C12=\"\",\"\",GetName($C12))","v":"iShares Nasdaq Biotechnology In\n"},"IN Position","IBB",100,"USD",374.4,"2015-07-03",0,48847.967999999993,370.28601000000003,370.90086400000001,{"$f":"IF(J12 > 0,K12-J12,\"\")","v":0.61485399999997981},{"$f":"IF(J12 > 0,(L12/J12),\"\")","v":1.6604840134251352E-3},37090.0864,-11757.881599999993,-0.24070359692341747,{"$f":"IFERROR(IF($F12>0,IF($B$6=\"Canada\",IF($E12=\"CAD\",$F12*((Settings!$B$2)+1),$F12*$E$9*((Settings!$B$2)+1)), IF($E12=\"USD\",$F12*((Settings!$B$2)+1),$F12*$E$9*((Settings!$B$2)+1))),””),\"\")","v":587.74809599999992},{"$f":"IFERROR(IF($F12>0,$AA12*(1-Settings!$B$3),\"\"),\"\")","v":470.19847679999998},"STOP",null,null,null,null,-11757.881599999993,-0.24070359692341747,37090.0864,489.79007999999999,{"$f":"IF($B12=\"Simulate\",0,IF(N12 = \"SOLD\", 0, N12))","v":37090.0864},{"$f":"IF($B12=\"Simulate\",0,IF(N12 = \"SOLD\",0,I12))","v":48847.967999999993},48847.967999999993,{"$f":"IF($C12<>\"\",GetStockNumParam($C12,\"h\"),\"\")","v":283.70999999999998},{"$f":"IF($B12=\"Simulate\",0,$I12)","v":48847.967999999993},{"$f":"IF($B12=\"Simulate\",0,Z12)","v":37090.0864},{"$f":"IF($B12=\"Simulate\",\"\",$O12)","v":-11757.881599999993}]
["BMO EQUAL WEIGHT US BANK IDX ET\n","IN Position","ZBK.TO",500,"CAD",20.03,"2015-07-15",9.99,10024.99,24.09,24.14,5.0000000000000711E-2,2.0755500207555299E-3,12070,2045.0100000000002,0.20399122592640992,{"$f":"IFERROR(IF($F13>0,IF($B$6=\"Canada\",IF($E13=\"CAD\",$F13*((Settings!$B$2)+1),$F13*$E$9*((Settings!$B$2)+1)), IF($E13=\"USD\",$F13*((Settings!$B$2)+1),$F13*$E$9*((Settings!$B$2)+1))),””),\"\")","v":24.036000000000001},{"$f":"IFERROR(IF($F13>0,$AA13*(1-Settings!$B$3),\"\"),\"\")","v":23.174399999999999},"SELL",null,null,null,null,2045.0100000000002,0.20399122592640984,12070,24.14,12070,10024.99,10024.99,{"$f":"IF($C13<>\"\",GetStockNumParam($C13,\"h\"),\"\")","v":24.35},10024.99,12070,2045.0100000000002]
["Bank of America Corporation Com\n","IN Position","BAC",500,"USD",17.670000000000002,"2015-07-15",9,11536.024500000001,30.467977999999999,30.225961000000002,-0.24201699999999704,-7.9433233147272533E-3,15112.980500000001,3576.9560000000001,0.31006834286803048,{"$f":"IFERROR(IF($F14>0,IF($B$6=\"Canada\",IF($E14=\"CAD\",$F14*((Settings!$B$2)+1),$F14*$E$9*((Settings!$B$2)+1)), IF($E14=\"USD\",$F14*((Settings!$B$2)+1),$F14*$E$9*((Settings!$B$2)+1))),””),\"\")","v":27.739072800000006},{"$f":"IFERROR(IF($F14>0,$AA14*(1-Settings!$B$3),\"\"),\"\")","v":29.016922560000001},"SELL",null,null,null,null,3576.9560000000001,0.31006834286803042,15112.980500000001,30.225961000000002,15112.980500000001,11536.024500000001,11536.024500000001,{"$f":"IF($C14<>\"\",GetStockNumParam($C14,\"h\"),\"\")","v":23.38},11536.024500000001,15112.980500000001,3576.9560000000001]
["ELEMENT FLEET MANAGEMENT CORP\n","IN Position","EFN.TO",500,"CAD",19.64,"2015-07-15",9,9760.48,12.75,13,0.25,1.9607843137254902E-2,6500,-3260.4799999999996,-0.33404914512401024,{"$f":"IFERROR(IF($F15>0,IF($B$6=\"Canada\",IF($E15=\"CAD\",$F15*((Settings!$B$2)+1),$F15*$E$9*((Settings!$B$2)+1)), IF($E15=\"USD\",$F15*((Settings!$B$2)+1),$F15*$E$9*((Settings!$B$2)+1))),””),\"\")","v":23.568000000000001},{"$f":"IFERROR(IF($F15>0,$AA15*(1-Settings!$B$3),\"\"),\"\")","v":18.854399999999998},"STOP",null,null,null,null,-3260.4799999999996,-0.33404914512401029,6500,19.64,6500,9760.48,9760.48,{"$f":"IF($C15<>\"\",GetStockNumParam($C15,\"h\"),\"\")","v":13.04},9760.48,6500,-3260.4799999999996]
["",null,null,null,null,null,null,null,null,null,null,"","","","","",{"$f":"IFERROR(IF($F16>0,IF($B$6=\"Canada\",IF($E16=\"CAD\",$F16*((Settings!$B$2)+1),$F16*$E$9*((Settings!$B$2)+1)), IF($E16=\"USD\",$F16*((Settings!$B$2)+1),$F16*$E$9*((Settings!$B$2)+1))),””),\"\")","v":""},{"$f":"IFERROR(IF($F16>0,$AA16*(1-Settings!$B$3),\"\"),\"\")","v":""},"",null,null,null,null,"","","",0,"",0,0,{"$f":"IF($C16<>\"\",GetStockNumParam($C16,\"h\"),\"\")","v":""},0,"",""]
["",null,null,null,null,null,null,null,null,null,null,"","","","","",{"$f":"IFERROR(IF($F17>0,IF($B$6=\"Canada\",IF($E17=\"CAD\",$F17*((Settings!$B$2)+1),$F17*$E$9*((Settings!$B$2)+1)), IF($E17=\"USD\",$F17*((Settings!$B$2)+1),$F17*$E$9*((Settings!$B$2)+1))),””),\"\")","v":""},{"$f":"IFERROR(IF($F17>0,$AA17*(1-Settings!$B$3),\"\"),\"\")","v":""},"",null,null,null,null,"","",{"$f":"IF(T17 > 0,T17*D17-V17+W17,N17)","v":""},0,"",0,0,{"$f":"IF($C17<>\"\",GetStockNumParam($C17,\"h\"),\"\")","v":""},0,"",""]
["CRESCENT POINT ENERGY CORP.\n","Watching","CPG.TO",0,"CAD",null,null,null,null,14.79,14.05,-0.73999999999999844,-5.0033806626098611E-2,"","","",{"$f":"IFERROR(IF($F18>0,IF($B$6=\"Canada\",IF($E18=\"CAD\",$F18*((Settings!$B$2)+1),$F18*$E$9*((Settings!$B$2)+1)), IF($E18=\"USD\",$F18*((Settings!$B$2)+1),$F18*$E$9*((Settings!$B$2)+1))),””),\"\")","v":""},{"$f":"IFERROR(IF($F18>0,$AA18*(1-Settings!$B$3),\"\"),\"\")","v":""},"",null,null,null,null,"","","",14.05,"",0,0,{"$f":"IF($C18<>\"\",GetStockNumParam($C18,\"h\"),\"\")","v":14.94},0,"",""]
["DH CORPORATION\n","Watching","DH.TO",0,"CAD",null,null,null,null,23.67,23.72,4.9999999999997158E-2,2.1123785382339312E-3,"","","",{"$f":"IFERROR(IF($F19>0,IF($B$6=\"Canada\",IF($E19=\"CAD\",$F19*((Settings!$B$2)+1),$F19*$E$9*((Settings!$B$2)+1)), IF($E19=\"USD\",$F19*((Settings!$B$2)+1),$F19*$E$9*((Settings!$B$2)+1))),””),\"\")","v":""},{"$f":"IFERROR(IF($F19>0,$AA19*(1-Settings!$B$3),\"\"),\"\")","v":""},"",null,null,null,null,"","","",23.72,"",0,0,{"$f":"IF($C19<>\"\",GetStockNumParam($C19,\"h\"),\"\")","v":23.92},0,"",""]
["FAIRFAX INDIA HOLDINGS CORPORAT\n","Watching","FIH-U.TO",0,"CAD",null,null,null,null,11.44,11.65,0.21000000000000085,1.8356643356643432E-2,"","","",{"$f":"IFERROR(IF($F20>0,IF($B$6=\"Canada\",IF($E20=\"CAD\",$F20*((Settings!$B$2)+1),$F20*$E$9*((Settings!$B$2)+1)), IF($E20=\"USD\",$F20*((Settings!$B$2)+1),$F20*$E$9*((Settings!$B$2)+1))),””),\"\")","v":""},{"$f":"IFERROR(IF($F20>0,$AA20*(1-Settings!$B$3),\"\"),\"\")","v":""},"",null,null,null,null,"","","",11.65,"",0,0,{"$f":"IF($C20<>\"\",GetStockNumParam($C20,\"h\"),\"\")","v":11.69},0,"",""]
["Walt Disney Company (The) Commo\n","Simulate","DIS",70,"USD",104.08000199999999,"2015-02-22",0,9450.1517599999988,144.29445999999999,143.14324400000001,-1.1512159999999767,-7.9782411604712809E-3,10020.02708,569.87532000000101,6.0303298240366149E-2,{"$f":"IFERROR(IF($F21>0,IF($B$6=\"Canada\",IF($E21=\"CAD\",$F21*((Settings!$B$2)+1),$F21*$E$9*((Settings!$B$2)+1)), IF($E21=\"USD\",$F21*((Settings!$B$2)+1),$F21*$E$9*((Settings!$B$2)+1))),””),\"\")","v":163.38895033967998},{"$f":"IFERROR(IF($F21>0,$AA21*(1-Settings!$B$3),\"\"),\"\")","v":137.41751424},"HOLD",null,null,null,null,569.87532000000101,6.0303298240366177E-2,10020.02708,143.14324400000001,0,0,9450.1517599999988,{"$f":"IF($C21<>\"\",GetStockNumParam($C21,\"h\"),\"\")","v":110.15},0,0,""]
["iShares Nasdaq Biotechnology In\n","Simulate","IBB",30,"USD",337.47000100000002,"2015-02-22",0,13131.97011,370.28601000000003,370.90086400000001,0.61485399999997981,1.6604840134251352E-3,11127.02592,-2004.9441900000002,-0.1526765727614042,{"$f":"IFERROR(IF($F22>0,IF($B$6=\"Canada\",IF($E22=\"CAD\",$F22*((Settings!$B$2)+1),$F22*$E$9*((Settings!$B$2)+1)), IF($E22=\"USD\",$F22*((Settings!$B$2)+1),$F22*$E$9*((Settings!$B$2)+1))),””),\"\")","v":529.77390636984001},{"$f":"IFERROR(IF($F22>0,$AA22*(1-Settings!$B$3),\"\"),\"\")","v":423.81912509587204},"STOP",null,null,null,null,-2004.9441900000002,-0.15267657276140423,11127.02592,441.47825530820006,0,0,13131.97011,{"$f":"IF($C22<>\"\",GetStockNumParam($C22,\"h\"),\"\")","v":283.70999999999998},0,0,""]
["BMO EQUAL WEIGHT US BANK IDX ET\n","Simulate","ZBK.TO",400,"CAD",17.91,"2015-02-22",0,7164,24.09,24.14,5.0000000000000711E-2,2.0755500207555299E-3,9656,2492,0.34785036292573979,{"$f":"IFERROR(IF($F23>0,IF($B$6=\"Canada\",IF($E23=\"CAD\",$F23*((Settings!$B$2)+1),$F23*$E$9*((Settings!$B$2)+1)), IF($E23=\"USD\",$F23*((Settings!$B$2)+1),$F23*$E$9*((Settings!$B$2)+1))),””),\"\")","v":21.492000000000001},{"$f":"IFERROR(IF($F23>0,$AA23*(1-Settings!$B$3),\"\"),\"\")","v":23.174399999999999},"SELL",null,null,null,null,2492,0.3478503629257399,9656,24.14,0,0,7164,{"$f":"IF($C23<>\"\",GetStockNumParam($C23,\"h\"),\"\")","v":24.35},0,0,""]
["Bank of America Corporation Com\n","Simulate","BAC",400,"USD",15.81,"2015-02-22",0,8202.8603999999996,30.467977999999999,30.225961000000002,-0.24201699999999704,-7.9433233147272533E-3,12090.384400000001,3887.5240000000013,0.47392297447851256,{"$f":"IFERROR(IF($F24>0,IF($B$6=\"Canada\",IF($E24=\"CAD\",$F24*((Settings!$B$2)+1),$F24*$E$9*((Settings!$B$2)+1)), IF($E24=\"USD\",$F24*((Settings!$B$2)+1),$F24*$E$9*((Settings!$B$2)+1))),””),\"\")","v":24.819170400000001},{"$f":"IFERROR(IF($F24>0,$AA24*(1-Settings!$B$3),\"\"),\"\")","v":29.016922560000001},"SELL",null,null,null,null,3887.5240000000013,0.4739229744785125,12090.384400000001,30.225961000000002,0,0,"Canada",{"$f":"IF($C24<>\"\",GetStockNumParam($C24,\"h\"),\"\")","v":23.38},0,0,""]
["ELEMENT FLEET MANAGEMENT CORP\n","Simulate","EFN.TO",500,"CAD",16.02,"2015-02-22",0,8010,12.75,13,0.25,1.9607843137254902E-2,6500,-1510,-0.18851435705368288,{"$f":"IFERROR(IF($F25>0,IF($B$6=\"Canada\",IF($E25=\"CAD\",$F25*((Settings!$B$2)+1),$F25*$E$9*((Settings!$B$2)+1)), IF($E25=\"USD\",$F25*((Settings!$B$2)+1),$F25*$E$9*((Settings!$B$2)+1))),””),\"\")","v":19.224},{"$f":"IFERROR(IF($F25>0,$AA25*(1-Settings!$B$3),\"\"),\"\")","v":15.379199999999999},"STOP",null,null,null,null,-1510,-0.18851435705368291,6500,16.02,0,0,"USA",{"$f":"IF($C25<>\"\",GetStockNumParam($C25,\"h\"),\"\")","v":13.04},0,0,""]
["",null,null,null,null,null,null,null,null,null,null,"","","","","",{"$f":"IFERROR(IF($F26>0,IF($B$6=\"Canada\",IF($E26=\"CAD\",$F26*((Settings!$B$2)+1),$F26*$E$9*((Settings!$B$2)+1)), IF($E26=\"USD\",$F26*((Settings!$B$2)+1),$F26*$E$9*((Settings!$B$2)+1))),””),\"\")","v":""},{"$f":"IFERROR(IF($F26>0,$AA26*(1-Settings!$B$3),\"\"),\"\")","v":""},"",null,null,null,null,"","","",0,"",0,0,{"$f":"IF($C26<>\"\",GetStockNumParam($C26,\"h\"),\"\")","v":""},0,"",""]
["BMO EQUAL WEIGHT US BANK IDX ET\n","OUT Position","ZBK.TO",600,"CAD",19.079999999999998,"2015-07-03",0,11465.61,24.09,24.14,5.0000000000000711E-2,2.0755500207555299E-3,"SOLD",180.38999999999942,1.5733135873276644E-2,{"$f":"IFERROR(IF($F27>0,IF($B$6=\"Canada\",IF($E27=\"CAD\",$F27*((Settings!$B$2)+1),$F27*$E$9*((Settings!$B$2)+1)), IF($E27=\"USD\",$F27*((Settings!$B$2)+1),$F27*$E$9*((Settings!$B$2)+1))),””),\"\")","v":22.895999999999997},{"$f":"IFERROR(IF($F27>0,$AA27*(1-Settings!$B$3),\"\"),\"\")","v":23.174399999999999},"SELL",19.41,"2015-07-14",0,0,180.38999999999942,1.5733135873276627E-2,11646,24.14,0,0,180.38999999999942,{"$f":"IF($C27<>\"\",GetStockNumParam($C27,\"h\"),\"\")","v":24.35},11465.61,11646,180.38999999999942]
["BMO EQL WGT US HCARE HDGD TO CA\n","OUT Position","ZUH.TO",250,"CAD",44.45,"2015-07-03",0,11170.53,41.62,41.44,-0.17999999999999972,-4.3248438250840879E-3,"SOLD",129.46999999999935,1.1590318454003466E-2,{"$f":"IFERROR(IF($F28>0,IF($B$6=\"Canada\",IF($E28=\"CAD\",$F28*((Settings!$B$2)+1),$F28*$E$9*((Settings!$B$2)+1)), IF($E28=\"USD\",$F28*((Settings!$B$2)+1),$F28*$E$9*((Settings!$B$2)+1))),””),\"\")","v":53.34},{"$f":"IFERROR(IF($F28>0,$AA28*(1-Settings!$B$3),\"\"),\"\")","v":42.672000000000004},"STOP",45.2,"2015-07-14",0,0,129.46999999999935,1.1590318454003379E-2,11300,44.45,0,0,129.46999999999935,{"$f":"IF($C28<>\"\",GetStockNumParam($C28,\"h\"),\"\")","v":41.62},11170.53,11300,129.46999999999935]
["ELEMENT FLEET MANAGEMENT CORP\n","OUT Position","EFN.TO",500,"CAD",19.34,"2015-07-10",9.99,9680.99,12.75,13,0.25,1.9607843137254902E-2,"SOLD",119.01000000000022,1.2293164232170493E-2,{"$f":"IFERROR(IF($F29>0,IF($B$6=\"Canada\",IF($E29=\"CAD\",$F29*((Settings!$B$2)+1),$F29*$E$9*((Settings!$B$2)+1)), IF($E29=\"USD\",$F29*((Settings!$B$2)+1),$F29*$E$9*((Settings!$B$2)+1))),””),\"\")","v":23.207999999999998},{"$f":"IFERROR(IF($F29>0,$AA29*(1-Settings!$B$3),\"\"),\"\")","v":18.566399999999998},"STOP",19.600000000000001,"2015-07-15",0,0,119.01000000000022,1.2293164232170417E-2,9800,19.34,0,0,119.01000000000022,{"$f":"IF($C29<>\"\",GetStockNumParam($C29,\"h\"),\"\")","v":13.04},9680.99,9800,119.01000000000022]
["",null,null,null,null,null,null,null,null,null,null,"","","","","",{"$f":"IFERROR(IF($F30>0,IF($B$6=\"Canada\",IF($E30=\"CAD\",$F30*((Settings!$B$2)+1),$F30*$E$9*((Settings!$B$2)+1)), IF($E30=\"USD\",$F30*((Settings!$B$2)+1),$F30*$E$9*((Settings!$B$2)+1))),””),\"\")","v":""},{"$f":"IFERROR(IF($F30>0,$AA30*(1-Settings!$B$3),\"\"),\"\")","v":""},"",null,null,null,null,"","","",0,"",0,0,{"$f":"IF($C30<>\"\",GetStockNumParam($C30,\"h\"),\"\")","v":""},0,"",""]
["BOMBARDIER INC., CL. A, MV\n","Watching","BBD-A.TO",0,null,null,null,null,0,2.64,2.62,-2.0000000000000018E-2,-7.575757575757582E-3,"","","",{"$f":"IFERROR(IF($F31>0,IF($B$6=\"Canada\",IF($E31=\"CAD\",$F31*((Settings!$B$2)+1),$F31*$E$9*((Settings!$B$2)+1)), IF($E31=\"USD\",$F31*((Settings!$B$2)+1),$F31*$E$9*((Settings!$B$2)+1))),””),\"\")","v":""},{"$f":"IFERROR(IF($F31>0,$AA31*(1-Settings!$B$3),\"\"),\"\")","v":""},"",null,null,null,null,"","","",2.62,"",0,0,{"$f":"IF($C31<>\"\",GetStockNumParam($C31,\"h\"),\"\")","v":2.65},0,"",""]
["BOMBARDIER INC., CL. B, SV\n","Watching","BBD-B.TO",0,null,null,null,null,0,2.59,2.5750000000000002,-1.499999999999968E-2,-5.791505791505668E-3,"","","",{"$f":"IFERROR(IF($F32>0,IF($B$6=\"Canada\",IF($E32=\"CAD\",$F32*((Settings!$B$2)+1),$F32*$E$9*((Settings!$B$2)+1)), IF($E32=\"USD\",$F32*((Settings!$B$2)+1),$F32*$E$9*((Settings!$B$2)+1))),””),\"\")","v":""},{"$f":"IFERROR(IF($F32>0,$AA32*(1-Settings!$B$3),\"\"),\"\")","v":""},"",null,null,null,null,"","","",2.5750000000000002,"",0,0,{"$f":"IF($C32<>\"\",GetStockNumParam($C32,\"h\"),\"\")","v":2.58},0,"",""]
["SAPUTO INC.\n","Watching","SAP.TO",0,null,null,null,null,0,45.55,44.725000000000001,-0.82499999999999574,-1.8111964873765003E-2,"","","",{"$f":"IFERROR(IF($F33>0,IF($B$6=\"Canada\",IF($E33=\"CAD\",$F33*((Settings!$B$2)+1),$F33*$E$9*((Settings!$B$2)+1)), IF($E33=\"USD\",$F33*((Settings!$B$2)+1),$F33*$E$9*((Settings!$B$2)+1))),””),\"\")","v":""},{"$f":"IFERROR(IF($F33>0,$AA33*(1-Settings!$B$3),\"\"),\"\")","v":""},"",null,null,null,null,"","","",44.725000000000001,"",0,0,{"$f":"IF($C33<>\"\",GetStockNumParam($C33,\"h\"),\"\")","v":45.44},0,"",""]
["TD US Small-Cap Equity - I\n","Watching","TD.TO",0,null,null,null,null,0,67.489999999999995,67.45,-3.9999999999992042E-2,-5.9268039709574815E-4,"","","",{"$f":"IFERROR(IF($F34>0,IF($B$6=\"Canada\",IF($E34=\"CAD\",$F34*((Settings!$B$2)+1),$F34*$E$9*((Settings!$B$2)+1)), IF($E34=\"USD\",$F34*((Settings!$B$2)+1),$F34*$E$9*((Settings!$B$2)+1))),””),\"\")","v":""},{"$f":"IFERROR(IF($F34>0,$AA34*(1-Settings!$B$3),\"\"),\"\")","v":""},"",null,null,null,null,"","","",67.45,"",0,0,{"$f":"IF($C34<>\"\",GetStockNumParam($C34,\"h\"),\"\")","v":67.819999999999993},0,"",""]
["AIRBOSS AMERICA J\n","Watching","BOS.TO",0,null,null,null,null,0,13.26,13.08,-0.17999999999999972,-1.3574660633484142E-2,"","","",{"$f":"IFERROR(IF($F35>0,IF($B$6=\"Canada\",IF($E35=\"CAD\",$F35*((Settings!$B$2)+1),$F35*$E$9*((Settings!$B$2)+1)), IF($E35=\"USD\",$F35*((Settings!$B$2)+1),$F35*$E$9*((Settings!$B$2)+1))),””),\"\")","v":""},{"$f":"IFERROR(IF($F35>0,$AA35*(1-Settings!$B$3),\"\"),\"\")","v":""},"",null,null,null,null,"","","",13.08,"",0,0,{"$f":"IF($C35<>\"\",GetStockNumParam($C35,\"h\"),\"\")","v":13.27},0,"",""]
["",null,null,null,null,null,null,null,null,null,null,"","","","","",{"$f":"IFERROR(IF($F36>0,IF($B$6=\"Canada\",IF($E36=\"CAD\",$F36*((Settings!$B$2)+1),$F36*$E$9*((Settings!$B$2)+1)), IF($E36=\"USD\",$F36*((Settings!$B$2)+1),$F36*$E$9*((Settings!$B$2)+1))),””),\"\")","v":""},{"$f":"IFERROR(IF($F36>0,$AA36*(1-Settings!$B$3),\"\"),\"\")","v":""},"",null,null,null,null,"","","",0,"",0,0,{"$f":"IF($C36<>\"\",GetStockNumParam($C36,\"h\"),\"\")","v":""},0,"",""]
["CANADIAN NATIONAL RAILWAY CO.\n","Simulate","CNR.TO",650,"CAD",77.81,"2015-07-17",9,50585.5,90.36,89.72,-0.64000000000000057,-7.0827799911465312E-3,58318,7732.5,0.15286000929120006,{"$f":"IFERROR(IF($F37>0,IF($B$6=\"Canada\",IF($E37=\"CAD\",$F37*((Settings!$B$2)+1),$F37*$E$9*((Settings!$B$2)+1)), IF($E37=\"USD\",$F37*((Settings!$B$2)+1),$F37*$E$9*((Settings!$B$2)+1))),””),\"\")","v":93.372},{"$f":"IFERROR(IF($F37>0,$AA37*(1-Settings!$B$3),\"\"),\"\")","v":86.131199999999993},"HOLD",null,null,null,null,7732.5,0.15286000929120003,58318,89.72,0,0,50585.5,{"$f":"IF($C37<>\"\",GetStockNumParam($C37,\"h\"),\"\")","v":90.31},0,0,""]
["BANK OF NOVA SCOTIA\n","Simulate","BNS.TO",800,"CAD",64.37,"2015-07-17",9,51505,78.400000000000006,78.3,-0.10000000000000853,-1.2755102040817414E-3,62640,11135,0.21619260265993592,{"$f":"IFERROR(IF($F38>0,IF($B$6=\"Canada\",IF($E38=\"CAD\",$F38*((Settings!$B$2)+1),$F38*$E$9*((Settings!$B$2)+1)), IF($E38=\"USD\",$F38*((Settings!$B$2)+1),$F38*$E$9*((Settings!$B$2)+1))),””),\"\")","v":77.244},{"$f":"IFERROR(IF($F38>0,$AA38*(1-Settings!$B$3),\"\"),\"\")","v":75.167999999999992},"SELL",null,null,null,null,11135,0.2161926026599359,62640,78.3,0,0,51505,{"$f":"IF($C38<>\"\",GetStockNumParam($C38,\"h\"),\"\")","v":78.53},0,0,""]
["CANADIAN NATIONAL RAILWAY CO.\n","Simulate","CNR.TO",700,"CAD",82,"2015-02-22",0,57400,90.36,89.72,-0.64000000000000057,-7.0827799911465312E-3,62804,5404,9.4146341463414634E-2,{"$f":"IFERROR(IF($F39>0,IF($B$6=\"Canada\",IF($E39=\"CAD\",$F39*((Settings!$B$2)+1),$F39*$E$9*((Settings!$B$2)+1)), IF($E39=\"USD\",$F39*((Settings!$B$2)+1),$F39*$E$9*((Settings!$B$2)+1))),””),\"\")","v":98.399999999999991},{"$f":"IFERROR(IF($F39>0,$AA39*(1-Settings!$B$3),\"\"),\"\")","v":86.131199999999993},"HOLD",null,null,null,null,5404,9.4146341463414718E-2,62804,89.72,0,0,57400,{"$f":"IF($C39<>\"\",GetStockNumParam($C39,\"h\"),\"\")","v":90.31},0,0,""]
["",null,null,null,null,null,null,null,null,null,null,"","","","","",{"$f":"IFERROR(IF($F40>0,IF($B$6=\"Canada\",IF($E40=\"CAD\",$F40*((Settings!$B$2)+1),$F40*$E$9*((Settings!$B$2)+1)), IF($E40=\"USD\",$F40*((Settings!$B$2)+1),$F40*$E$9*((Settings!$B$2)+1))),””),\"\")","v":""},{"$f":"IFERROR(IF($F40>0,$AA40*(1-Settings!$B$3),\"\"),\"\")","v":""},"",null,null,null,null,"","","",0,"",0,0,{"$f":"IF($C40<>\"\",GetStockNumParam($C40,\"h\"),\"\")","v":""},0,"",""]
["",null,null,null,null,null,null,null,null,null,null,"","","","","",{"$f":"IFERROR(IF($F41>0,IF($B$6=\"Canada\",IF($E41=\"CAD\",$F41*((Settings!$B$2)+1),$F41*$E$9*((Settings!$B$2)+1)), IF($E41=\"USD\",$F41*((Settings!$B$2)+1),$F41*$E$9*((Settings!$B$2)+1))),””),\"\")","v":""},{"$f":"IFERROR(IF($F41>0,$AA41*(1-Settings!$B$3),\"\"),\"\")","v":""},"",null,null,null,null,"","","",0,"",0,0,{"$f":"IF($C41<>\"\",GetStockNumParam($C41,\"h\"),\"\")","v":""},0,"",""]
["",null,null,null,null,null,null,null,null,null,null,"","","","","",{"$f":"IFERROR(IF($F42>0,IF($B$6=\"Canada\",IF($E42=\"CAD\",$F42*((Settings!$B$2)+1),$F42*$E$9*((Settings!$B$2)+1)), IF($E42=\"USD\",$F42*((Settings!$B$2)+1),$F42*$E$9*((Settings!$B$2)+1))),””),\"\")","v":""},{"$f":"IFERROR(IF($F42>0,$AA42*(1-Settings!$B$3),\"\"),\"\")","v":""},"",null,null,null,null,"","","",0,"",0,0,{"$f":"IF($C42<>\"\",GetStockNumParam($C42,\"h\"),\"\")","v":""},0,"",""]
["",null,null,null,null,null,null,null,null,null,null,"","","","","",{"$f":"IFERROR(IF($F43>0,IF($B$6=\"Canada\",IF($E43=\"CAD\",$F43*((Settings!$B$2)+1),$F43*$E$9*((Settings!$B$2)+1)), IF($E43=\"USD\",$F43*((Settings!$B$2)+1),$F43*$E$9*((Settings!$B$2)+1))),””),\"\")","v":""},{"$f":"IFERROR(IF($F43>0,$AA43*(1-Settings!$B$3),\"\"),\"\")","v":""},"",null,null,null,null,"","","",0,"",0,0,{"$f":"IF($C43<>\"\",GetStockNumParam($C43,\"h\"),\"\")","v":""},0,"",""]
["BMO INDIA EQUITY INDEX ETF\n","Watching","ZID.TO",0,null,null,null,null,0,18.82,19.16,0.33999999999999986,1.8065887353878846E-2,"","","",{"$f":"IFERROR(IF($F44>0,IF($B$6=\"Canada\",IF($E44=\"CAD\",$F44*((Settings!$B$2)+1),$F44*$E$9*((Settings!$B$2)+1)), IF($E44=\"USD\",$F44*((Settings!$B$2)+1),$F44*$E$9*((Settings!$B$2)+1))),””),\"\")","v":""},{"$f":"IFERROR(IF($F44>0,$AA44*(1-Settings!$B$3),\"\"),\"\")","v":""},"",null,null,null,null,"","","",19.16,"",0,0,{"$f":"IF($C44<>\"\",GetStockNumParam($C44,\"h\"),\"\")","v":19.16},0,"",""]
["iSHARES SP TSX CAPPED CONS STPL\n","Watching","XST.TO",0,null,null,null,null,0,51.4,51.01,-0.39000000000000057,-7.5875486381323069E-3,"","","",{"$f":"IFERROR(IF($F45>0,IF($B$6=\"Canada\",IF($E45=\"CAD\",$F45*((Settings!$B$2)+1),$F45*$E$9*((Settings!$B$2)+1)), IF($E45=\"USD\",$F45*((Settings!$B$2)+1),$F45*$E$9*((Settings!$B$2)+1))),””),\"\")","v":""},{"$f":"IFERROR(IF($F45>0,$AA45*(1-Settings!$B$3),\"\"),\"\")","v":""},"",null,null,null,null,"","","",51.01,"",0,0,{"$f":"IF($C45<>\"\",GetStockNumParam($C45,\"h\"),\"\")","v":51.39},0,"",""]
["QUEBECOR INC., CL.B, SV\n","Watching","QBR-B.TO",0,null,null,null,null,0,38.99,39.14,0.14999999999999858,3.8471402923826257E-3,"","","",{"$f":"IFERROR(IF($F46>0,IF($B$6=\"Canada\",IF($E46=\"CAD\",$F46*((Settings!$B$2)+1),$F46*$E$9*((Settings!$B$2)+1)), IF($E46=\"USD\",$F46*((Settings!$B$2)+1),$F46*$E$9*((Settings!$B$2)+1))),””),\"\")","v":""},{"$f":"IFERROR(IF($F46>0,$AA46*(1-Settings!$B$3),\"\"),\"\")","v":""},"",null,null,null,null,"","","",39.14,"",0,0,{"$f":"IF($C46<>\"\",GetStockNumParam($C46,\"h\"),\"\")","v":39.25},0,"",""]
["",null,null,null,null,null,null,null,null,null,null,"","","","","",{"$f":"IFERROR(IF($F47>0,IF($B$6=\"Canada\",IF($E47=\"CAD\",$F47*((Settings!$B$2)+1),$F47*$E$9*((Settings!$B$2)+1)), IF($E47=\"USD\",$F47*((Settings!$B$2)+1),$F47*$E$9*((Settings!$B$2)+1))),””),\"\")","v":""},{"$f":"IFERROR(IF($F47>0,$AA47*(1-Settings!$B$3),\"\"),\"\")","v":""},"",null,null,null,null,"","","",0,"",0,0,{"$f":"IF($C47<>\"\",GetStockNumParam($C47,\"h\"),\"\")","v":""},0,"",""]
["",null,null,null,null,null,null,null,null,null,null,"","","","","",{"$f":"IFERROR(IF($F48>0,IF($B$6=\"Canada\",IF($E48=\"CAD\",$F48*((Settings!$B$2)+1),$F48*$E$9*((Settings!$B$2)+1)), IF($E48=\"USD\",$F48*((Settings!$B$2)+1),$F48*$E$9*((Settings!$B$2)+1))),””),\"\")","v":""},{"$f":"IFERROR(IF($F48>0,$AA48*(1-Settings!$B$3),\"\"),\"\")","v":""},"",null,null,null,null,"","","",0,"",0,0,{"$f":"IF($C48<>\"\",GetStockNumParam($C48,\"h\"),\"\")","v":""},0,"",""]
["AMERICAS SILVER CORPORATION\n","Simulate","SPM.TO",1000,"CAD",0.17,"2015-07-26",0,170,0,0,"","",0,-170,-1,{"$f":"IFERROR(IF($F49>0,IF($B$6=\"Canada\",IF($E49=\"CAD\",$F49*((Settings!$B$2)+1),$F49*$E$9*((Settings!$B$2)+1)), IF($E49=\"USD\",$F49*((Settings!$B$2)+1),$F49*$E$9*((Settings!$B$2)+1))),””),\"\")","v":0.20400000000000001},{"$f":"IFERROR(IF($F49>0,$AA49*(1-Settings!$B$3),\"\"),\"\")","v":0.16320000000000001},"STOP",null,null,null,null,0,0,0,0.17,0,0,170,{"$f":"IF($C49<>\"\",GetStockNumParam($C49,\"h\"),\"\")","v":0},0,0,""]
["GOLDEN ARROW RES CORP.\n","Simulate","GRG.V",1000,"CAD",0.28999999999999998,"2015-07-26",0,290,0.74,0.76,2.0000000000000018E-2,2.7027027027027053E-2,760,470,1.6206896551724137,{"$f":"IFERROR(IF($F50>0,IF($B$6=\"Canada\",IF($E50=\"CAD\",$F50*((Settings!$B$2)+1),$F50*$E$9*((Settings!$B$2)+1)), IF($E50=\"USD\",$F50*((Settings!$B$2)+1),$F50*$E$9*((Settings!$B$2)+1))),””),\"\")","v":0.34799999999999998},{"$f":"IFERROR(IF($F50>0,$AA50*(1-Settings!$B$3),\"\"),\"\")","v":0.72960000000000003},"SELL",null,null,null,null,470,1.6206896551724137,760,0.76,0,0,290,{"$f":"IF($C50<>\"\",GetStockNumParam($C50,\"h\"),\"\")","v":0.76},0,0,""]
["YAMANA GOLD INC\n","Simulate","YRI.TO",1000,"CAD",2.67,"2015-07-26",0,2670,4.43,4.6399999999999997,0.20999999999999996,4.7404063205417603E-2,4640,1970,0.73782771535580527,{"$f":"IFERROR(IF($F51>0,IF($B$6=\"Canada\",IF($E51=\"CAD\",$F51*((Settings!$B$2)+1),$F51*$E$9*((Settings!$B$2)+1)), IF($E51=\"USD\",$F51*((Settings!$B$2)+1),$F51*$E$9*((Settings!$B$2)+1))),””),\"\")","v":3.2039999999999997},{"$f":"IFERROR(IF($F51>0,$AA51*(1-Settings!$B$3),\"\"),\"\")","v":4.4543999999999997},"SELL",null,null,null,null,1970,0.73782771535580527,4640,4.6399999999999997,0,0,2670,{"$f":"IF($C51<>\"\",GetStockNumParam($C51,\"h\"),\"\")","v":4.6399999999999997},0,0,""]
["GOLDCORP INC\n","Simulate","G.TO",1000,"CAD",17.350000000000001,"2015-07-26",0,17350,21.21,21.93,0.71999999999999886,3.394625176803389E-2,21930,4580,0.2639769452449568,{"$f":"IFERROR(IF($F52>0,IF($B$6=\"Canada\",IF($E52=\"CAD\",$F52*((Settings!$B$2)+1),$F52*$E$9*((Settings!$B$2)+1)), IF($E52=\"USD\",$F52*((Settings!$B$2)+1),$F52*$E$9*((Settings!$B$2)+1))),””),\"\")","v":20.82},{"$f":"IFERROR(IF($F52>0,$AA52*(1-Settings!$B$3),\"\"),\"\")","v":21.052799999999998},"SELL",null,null,null,null,4580,0.26397694524495674,21930,21.93,0,0,17350,{"$f":"IF($C52<>\"\",GetStockNumParam($C52,\"h\"),\"\")","v":21.96},0,0,""]
["BARRICK GOLD CORPORATION\n","Simulate","ABX.TO",1000,"CAD",9.4700000000000006,"2015-07-26",0,9470,24.67,25.3,0.62999999999999901,2.553708958248881E-2,25300,15830,1.6715945089757127,{"$f":"IFERROR(IF($F53>0,IF($B$6=\"Canada\",IF($E53=\"CAD\",$F53*((Settings!$B$2)+1),$F53*$E$9*((Settings!$B$2)+1)), IF($E53=\"USD\",$F53*((Settings!$B$2)+1),$F53*$E$9*((Settings!$B$2)+1))),””),\"\")","v":11.364000000000001},{"$f":"IFERROR(IF($F53>0,$AA53*(1-Settings!$B$3),\"\"),\"\")","v":24.288},"SELL",null,null,null,null,15830,1.6715945089757129,25300,25.3,0,0,9470,{"$f":"IF($C53<>\"\",GetStockNumParam($C53,\"h\"),\"\")","v":25.31},0,0,""]
["KINROSS GOLD CORP.\n","Simulate","K.TO",1000,"CAD",2.2200000000000002,"2015-07-26",0,2220,5.0999999999999996,5.38,0.28000000000000025,5.490196078431378E-2,5380,3160,1.4234234234234233,{"$f":"IFERROR(IF($F54>0,IF($B$6=\"Canada\",IF($E54=\"CAD\",$F54*((Settings!$B$2)+1),$F54*$E$9*((Settings!$B$2)+1)), IF($E54=\"USD\",$F54*((Settings!$B$2)+1),$F54*$E$9*((Settings!$B$2)+1))),””),\"\")","v":2.6640000000000001},{"$f":"IFERROR(IF($F54>0,$AA54*(1-Settings!$B$3),\"\"),\"\")","v":5.1647999999999996},"SELL",null,null,null,null,3160,1.4234234234234235,5380,5.38,0,0,2220,{"$f":"IF($C54<>\"\",GetStockNumParam($C54,\"h\"),\"\")","v":5.38},0,0,""]
["DETOUR GOLD CORPORATION\n","Simulate","DGC.TO",1000,"CAD",11.51,"2015-07-26",0,11510,18.72,19.72,1,5.3418803418803423E-2,19720,8210,0.71329278887923542,{"$f":"IFERROR(IF($F55>0,IF($B$6=\"Canada\",IF($E55=\"CAD\",$F55*((Settings!$B$2)+1),$F55*$E$9*((Settings!$B$2)+1)), IF($E55=\"USD\",$F55*((Settings!$B$2)+1),$F55*$E$9*((Settings!$B$2)+1))),””),\"\")","v":13.811999999999999},{"$f":"IFERROR(IF($F55>0,$AA55*(1-Settings!$B$3),\"\"),\"\")","v":18.931199999999997},"SELL",null,null,null,null,8210,0.71329278887923553,19720,19.72,0,0,11510,{"$f":"IF($C55<>\"\",GetStockNumParam($C55,\"h\"),\"\")","v":19.75},0,0,""]
["SILVER WHEATON CORP.\n","Simulate","SLW.TO",1000,"CAD",16.87,"2015-07-26",0,16870,28.92,29.54,0.61999999999999744,2.1438450899031722E-2,29540,12670,0.75103734439834025,{"$f":"IFERROR(IF($F56>0,IF($B$6=\"Canada\",IF($E56=\"CAD\",$F56*((Settings!$B$2)+1),$F56*$E$9*((Settings!$B$2)+1)), IF($E56=\"USD\",$F56*((Settings!$B$2)+1),$F56*$E$9*((Settings!$B$2)+1))),””),\"\")","v":20.244},{"$f":"IFERROR(IF($F56>0,$AA56*(1-Settings!$B$3),\"\"),\"\")","v":28.3584},"SELL",null,null,null,null,12670,0.75103734439834025,29540,29.54,0,0,16870,{"$f":"IF($C56<>\"\",GetStockNumParam($C56,\"h\"),\"\")","v":29.55},0,0,""]
["TAHOE RESOURCES INC\n","Simulate","THO.TO",1000,"CAD",10.95,"2015-07-26",0,10950,11.77,12.26,0.49000000000000021,4.1631265930331368E-2,12260,1310,0.11963470319634703,{"$f":"IFERROR(IF($F57>0,IF($B$6=\"Canada\",IF($E57=\"CAD\",$F57*((Settings!$B$2)+1),$F57*$E$9*((Settings!$B$2)+1)), IF($E57=\"USD\",$F57*((Settings!$B$2)+1),$F57*$E$9*((Settings!$B$2)+1))),””),\"\")","v":13.139999999999999},{"$f":"IFERROR(IF($F57>0,$AA57*(1-Settings!$B$3),\"\"),\"\")","v":11.769599999999999},"HOLD",null,null,null,null,1310,0.11963470319634695,12260,12.26,0,0,10950,{"$f":"IF($C57<>\"\",GetStockNumParam($C57,\"h\"),\"\")","v":12.27},0,0,""]
["PAN AMERICAN J\n","Simulate","PAA.TO",1000,"CAD",8.39,"2015-07-26",0,8390,24.53,25.36,0.82999999999999829,3.3836119037912692E-2,25360,16970,2.0226460071513706,{"$f":"IFERROR(IF($F58>0,IF($B$6=\"Canada\",IF($E58=\"CAD\",$F58*((Settings!$B$2)+1),$F58*$E$9*((Settings!$B$2)+1)), IF($E58=\"USD\",$F58*((Settings!$B$2)+1),$F58*$E$9*((Settings!$B$2)+1))),””),\"\")","v":10.068},{"$f":"IFERROR(IF($F58>0,$AA58*(1-Settings!$B$3),\"\"),\"\")","v":24.345599999999997},"SELL",null,null,null,null,16970,2.0226460071513706,25360,25.36,0,0,8390,{"$f":"IF($C58<>\"\",GetStockNumParam($C58,\"h\"),\"\")","v":25.67},0,0,""]
["MAG SILVER CORP.\n","Simulate","MAG.TO",1000,"CAD",8.8699999999999992,"2015-07-26",0,8870,19.52,20.62,1.1000000000000014,5.6352459016393519E-2,20620,11750,1.3246899661781286,{"$f":"IFERROR(IF($F59>0,IF($B$6=\"Canada\",IF($E59=\"CAD\",$F59*((Settings!$B$2)+1),$F59*$E$9*((Settings!$B$2)+1)), IF($E59=\"USD\",$F59*((Settings!$B$2)+1),$F59*$E$9*((Settings!$B$2)+1))),””),\"\")","v":10.643999999999998},{"$f":"IFERROR(IF($F59>0,$AA59*(1-Settings!$B$3),\"\"),\"\")","v":19.795200000000001},"SELL",null,null,null,null,11750,1.3246899661781284,20620,20.62,0,0,8870,{"$f":"IF($C59<>\"\",GetStockNumParam($C59,\"h\"),\"\")","v":20.7},0,0,""]
["GOLDMONEY INC\n","Simulate","XAU.V",1000,"CAD",5.4,"2015-07-26",0,5400,4.49,4.49,0,0,4490,-910,-0.16851851851851851,{"$f":"IFERROR(IF($F60>0,IF($B$6=\"Canada\",IF($E60=\"CAD\",$F60*((Settings!$B$2)+1),$F60*$E$9*((Settings!$B$2)+1)), IF($E60=\"USD\",$F60*((Settings!$B$2)+1),$F60*$E$9*((Settings!$B$2)+1))),””),\"\")","v":6.48},{"$f":"IFERROR(IF($F60>0,$AA60*(1-Settings!$B$3),\"\"),\"\")","v":5.1840000000000002},"STOP",null,null,null,null,-910,-0.16851851851851851,4490,5.4,0,0,5400,{"$f":"IF($C60<>\"\",GetStockNumParam($C60,\"h\"),\"\")","v":4.55},0,0,""]
["",null,null,null,null,null,null,null,null,null,null,"","","","","",{"$f":"IFERROR(IF($F61>0,IF($B$6=\"Canada\",IF($E61=\"CAD\",$F61*((Settings!$B$2)+1),$F61*$E$9*((Settings!$B$2)+1)), IF($E61=\"USD\",$F61*((Settings!$B$2)+1),$F61*$E$9*((Settings!$B$2)+1))),””),\"\")","v":""},{"$f":"IFERROR(IF($F61>0,$AA61*(1-Settings!$B$3),\"\"),\"\")","v":""},"",null,null,null,null,"","","",0,"",0,0,{"$f":"IF($C61<>\"\",GetStockNumParam($C61,\"h\"),\"\")","v":""},0,"",""]
["",null,null,null,null,null,null,null,null,null,null,"","","","","",{"$f":"IFERROR(IF($F62>0,IF($B$6=\"Canada\",IF($E62=\"CAD\",$F62*((Settings!$B$2)+1),$F62*$E$9*((Settings!$B$2)+1)), IF($E62=\"USD\",$F62*((Settings!$B$2)+1),$F62*$E$9*((Settings!$B$2)+1))),””),\"\")","v":""},{"$f":"IFERROR(IF($F62>0,$AA62*(1-Settings!$B$3),\"\"),\"\")","v":""},"",null,null,null,null,"","","",0,"",0,0,{"$f":"IF($C62<>\"\",GetStockNumParam($C62,\"h\"),\"\")","v":""},0,"",""]
["",null,null,null,null,null,null,null,null,null,null,"","","","","",{"$f":"IFERROR(IF($F63>0,IF($B$6=\"Canada\",IF($E63=\"CAD\",$F63*((Settings!$B$2)+1),$F63*$E$9*((Settings!$B$2)+1)), IF($E63=\"USD\",$F63*((Settings!$B$2)+1),$F63*$E$9*((Settings!$B$2)+1))),””),\"\")","v":""},{"$f":"IFERROR(IF($F63>0,$AA63*(1-Settings!$B$3),\"\"),\"\")","v":""},"",null,null,null,null,"","","",0,"",0,0,{"$f":"IF($C63<>\"\",GetStockNumParam($C63,\"h\"),\"\")","v":""},0,"",""]
["",null,null,null,null,null,null,null,null,null,null,"","","","","",{"$f":"IFERROR(IF($F64>0,IF($B$6=\"Canada\",IF($E64=\"CAD\",$F64*((Settings!$B$2)+1),$F64*$E$9*((Settings!$B$2)+1)), IF($E64=\"USD\",$F64*((Settings!$B$2)+1),$F64*$E$9*((Settings!$B$2)+1))),””),\"\")","v":""},{"$f":"IFERROR(IF($F64>0,$AA64*(1-Settings!$B$3),\"\"),\"\")","v":""},"",null,null,null,null,"","","",0,"",0,0,{"$f":"IF($C64<>\"\",GetStockNumParam($C64,\"h\"),\"\")","v":""},0,"",""]
["",null,null,null,null,null,null,null,null,null,null,"","","","","",{"$f":"IFERROR(IF($F65>0,IF($B$6=\"Canada\",IF($E65=\"CAD\",$F65*((Settings!$B$2)+1),$F65*$E$9*((Settings!$B$2)+1)), IF($E65=\"USD\",$F65*((Settings!$B$2)+1),$F65*$E$9*((Settings!$B$2)+1))),””),\"\")","v":""},{"$f":"IFERROR(IF($F65>0,$AA65*(1-Settings!$B$3),\"\"),\"\")","v":""},"",null,null,null,null,"","","",0,"",0,0,{"$f":"IF($C65<>\"\",GetStockNumParam($C65,\"h\"),\"\")","v":""},0,"",""]
["",null,null,null,null,null,null,null,null,null,null,"","","","","",{"$f":"IFERROR(IF($F66>0,IF($B$6=\"Canada\",IF($E66=\"CAD\",$F66*((Settings!$B$2)+1),$F66*$E$9*((Settings!$B$2)+1)), IF($E66=\"USD\",$F66*((Settings!$B$2)+1),$F66*$E$9*((Settings!$B$2)+1))),””),\"\")","v":""},{"$f":"IFERROR(IF($F66>0,$AA66*(1-Settings!$B$3),\"\"),\"\")","v":""},"",null,null,null,null,"","","",0,"",0,0,{"$f":"IF($C66<>\"\",GetStockNumParam($C66,\"h\"),\"\")","v":""},0,"",""]
["",null,null,null,null,null,null,null,null,null,null,"","","","","",{"$f":"IFERROR(IF($F67>0,IF($B$6=\"Canada\",IF($E67=\"CAD\",$F67*((Settings!$B$2)+1),$F67*$E$9*((Settings!$B$2)+1)), IF($E67=\"USD\",$F67*((Settings!$B$2)+1),$F67*$E$9*((Settings!$B$2)+1))),””),\"\")","v":""},{"$f":"IFERROR(IF($F67>0,$AA67*(1-Settings!$B$3),\"\"),\"\")","v":""},"",null,null,null,null,"","","",0,"",0,0,{"$f":"IF($C67<>\"\",GetStockNumParam($C67,\"h\"),\"\")","v":""},0,"",""]
["",null,null,null,null,null,null,null,null,null,null,"","","","","",{"$f":"IFERROR(IF($F68>0,IF($B$6=\"Canada\",IF($E68=\"CAD\",$F68*((Settings!$B$2)+1),$F68*$E$9*((Settings!$B$2)+1)), IF($E68=\"USD\",$F68*((Settings!$B$2)+1),$F68*$E$9*((Settings!$B$2)+1))),””),\"\")","v":""},{"$f":"IFERROR(IF($F68>0,$AA68*(1-Settings!$B$3),\"\"),\"\")","v":""},"",null,null,null,null,"","","",0,"",0,0,{"$f":"IF($C68<>\"\",GetStockNumParam($C68,\"h\"),\"\")","v":""},0,"",""]
["",null,null,null,null,null,null,null,null,null,null,"","","","","",{"$f":"IFERROR(IF($F69>0,IF($B$6=\"Canada\",IF($E69=\"CAD\",$F69*((Settings!$B$2)+1),$F69*$E$9*((Settings!$B$2)+1)), IF($E69=\"USD\",$F69*((Settings!$B$2)+1),$F69*$E$9*((Settings!$B$2)+1))),””),\"\")","v":""},{"$f":"IFERROR(IF($F69>0,$AA69*(1-Settings!$B$3),\"\"),\"\")","v":""},"",null,null,null,null,"","","",0,"",0,0,{"$f":"IF($C69<>\"\",GetStockNumParam($C69,\"h\"),\"\")","v":""},0,"",""]
["",null,null,null,null,null,null,null,null,null,null,"","","","","",{"$f":"IFERROR(IF($F70>0,IF($B$6=\"Canada\",IF($E70=\"CAD\",$F70*((Settings!$B$2)+1),$F70*$E$9*((Settings!$B$2)+1)), IF($E70=\"USD\",$F70*((Settings!$B$2)+1),$F70*$E$9*((Settings!$B$2)+1))),””),\"\")","v":""},{"$f":"IFERROR(IF($F70>0,$AA70*(1-Settings!$B$3),\"\"),\"\")","v":""},"",null,null,null,null,"","","",0,"",0,0,{"$f":"IF($C70<>\"\",GetStockNumParam($C70,\"h\"),\"\")","v":""},0,"",""]
["",null,null,null,null,null,null,null,null,null,null,"","","","","",{"$f":"IFERROR(IF($F71>0,IF($B$6=\"Canada\",IF($E71=\"CAD\",$F71*((Settings!$B$2)+1),$F71*$E$9*((Settings!$B$2)+1)), IF($E71=\"USD\",$F71*((Settings!$B$2)+1),$F71*$E$9*((Settings!$B$2)+1))),””),\"\")","v":""},{"$f":"IFERROR(IF($F71>0,$AA71*(1-Settings!$B$3),\"\"),\"\")","v":""},"",null,null,null,null,"","","",0,"",0,0,{"$f":"IF($C71<>\"\",GetStockNumParam($C71,\"h\"),\"\")","v":""},0,"",""]
["",null,null,null,null,null,null,null,null,null,null,"","","","","",{"$f":"IFERROR(IF($F72>0,IF($B$6=\"Canada\",IF($E72=\"CAD\",$F72*((Settings!$B$2)+1),$F72*$E$9*((Settings!$B$2)+1)), IF($E72=\"USD\",$F72*((Settings!$B$2)+1),$F72*$E$9*((Settings!$B$2)+1))),””),\"\")","v":""},{"$f":"IFERROR(IF($F72>0,$AA72*(1-Settings!$B$3),\"\"),\"\")","v":""},"",null,null,null,null,"","","",0,"",0,0,{"$f":"IF($C72<>\"\",GetStockNumParam($C72,\"h\"),\"\")","v":""},0,"",""]
["",null,null,null,null,null,null,null,null,null,null,"","","","","",{"$f":"IFERROR(IF($F73>0,IF($B$6=\"Canada\",IF($E73=\"CAD\",$F73*((Settings!$B$2)+1),$F73*$E$9*((Settings!$B$2)+1)), IF($E73=\"USD\",$F73*((Settings!$B$2)+1),$F73*$E$9*((Settings!$B$2)+1))),””),\"\")","v":""},{"$f":"IFERROR(IF($F73>0,$AA73*(1-Settings!$B$3),\"\"),\"\")","v":""},"",null,null,null,null,"","","",0,"",0,0,{"$f":"IF($C73<>\"\",GetStockNumParam($C73,\"h\"),\"\")","v":""},0,"",""]
["",null,null,null,null,null,null,null,null,null,null,"","","","","",{"$f":"IFERROR(IF($F74>0,IF($B$6=\"Canada\",IF($E74=\"CAD\",$F74*((Settings!$B$2)+1),$F74*$E$9*((Settings!$B$2)+1)), IF($E74=\"USD\",$F74*((Settings!$B$2)+1),$F74*$E$9*((Settings!$B$2)+1))),””),\"\")","v":""},{"$f":"IFERROR(IF($F74>0,$AA74*(1-Settings!$B$3),\"\"),\"\")","v":""},"",null,null,null,null,"","","",0,"",0,0,{"$f":"IF($C74<>\"\",GetStockNumParam($C74,\"h\"),\"\")","v":""},0,"",""]
["",null,null,null,null,null,null,null,null,null,null,"","",{"$f":"IF(D75 > 0,IF(T75 > 0,\"SOLD\",D75*K75),\"\")","v":""},{"$f":"IF(D75 > 0,IF(T75 > 0, Z75-I75, N75-I75),\"\")","v":""},{"$f":"IF(D75 > 0,IF(O75=0,0,(O75/I75)),\"\")","v":""},{"$f":"IFERROR(IF($F75>0,IF($B$6=\"Canada\",IF($E75=\"CAD\",$F75*((Settings!$B$2)+1),$F75*$E$9*((Settings!$B$2)+1)), IF($E75=\"USD\",$F75*((Settings!$B$2)+1),$F75*$E$9*((Settings!$B$2)+1))),””),\"\")","v":""},{"$f":"IFERROR(IF($F75>0,$AA75*(1-Settings!$B$3),\"\"),\"\")","v":""},{"$f":"IF(F75>0,IF(K75>=Q75,\"SELL\",IF(K75<=R75,\"STOP\",\"HOLD\")),\"\")","v":""},null,null,null,null,{"$f":"IF(D75 > 0,IF(Z75 = 0,0,Z75-I75),\"\")","v":""},{"$f":"IF(D75 > 0,IF(Z75=0,0,(Z75/I75)-100%),\"\")","v":""},{"$f":"IF(T75 > 0,T75*D75-V75+W75,N75)","v":""},0,"",0,{"$f":"IF(N75 = \"SOLD\", Z75-I75,I75)","v":0},{"$f":"IF($C75<>\"\",GetStockNumParam($C75,\"h\"),\"\")","v":""},0,"",""]
[{"$f":"IF($C76=\"\",\"\",GetName($C76))","v":""},null,null,null,null,null,null,null,null,null,null,{"$f":"IF(J76 > 0,K76-J76,\"\")","v":""},{"$f":"IF(J76 > 0,(L76/J76),\"\")","v":""},"","","",{"$f":"IFERROR(IF($F76>0,IF($B$6=\"Canada\",IF($E76=\"CAD\",$F76*((Settings!$B$2)+1),$F76*$E$9*((Settings!$B$2)+1)), IF($E76=\"USD\",$F76*((Settings!$B$2)+1),$F76*$E$9*((Settings!$B$2)+1))),””),\"\")","v":""},{"$f":"IFERROR(IF($F76>0,$AA76*(1-Settings!$B$3),\"\"),\"\")","v":""},"",null,null,null,null,"","","",{"$f":"IF($B$6=\"Canada\",\nIF($E76=\"CAD\",IF($F76>$K76,$F76,$K76),IF(($F76*$E$9)>$K76,($F76*$E$9),$K76)),\nIF($E76=\"CAD\",IF(($F76*$E$9)>$K76,($F76*$E$9),$K76),IF($F76>$K76,$F76,$K76)))","v":0},{"$f":"IF($B76=\"Simulate\",0,IF(N76 = \"SOLD\", 0, N76))","v":""},{"$f":"IF($B76=\"Simulate\",0,IF(N76 = \"SOLD\",0,I76))","v":0},0,{"$f":"IF($C76<>\"\",GetStockNumParam($C76,\"h\"),\"\")","v":""},{"$f":"IF($B76=\"Simulate\",0,$I76)","v":0},{"$f":"IF($B76=\"Simulate\",0,Z76)","v":""},{"$f":"IF($B76=\"Simulate\",\"\",$O76)","v":""}]
["",null,null,null,null,null,null,null,null,null,null,"","","","","",{"$f":"IFERROR(IF($F77>0,IF($B$6=\"Canada\",IF($E77=\"CAD\",$F77*((Settings!$B$2)+1),$F77*$E$9*((Settings!$B$2)+1)), IF($E77=\"USD\",$F77*((Settings!$B$2)+1),$F77*$E$9*((Settings!$B$2)+1))),””),\"\")","v":""},{"$f":"IFERROR(IF($F77>0,$AA77*(1-Settings!$B$3),\"\"),\"\")","v":""},"",null,null,null,null,"","","",0,"",0,0,{"$f":"IF($C77<>\"\",GetStockNumParam($C77,\"h\"),\"\")","v":""},0,"",""]
["",null,null,null,null,null,null,null,null,null,null,"","","","","",{"$f":"IFERROR(IF($F78>0,IF($B$6=\"Canada\",IF($E78=\"CAD\",$F78*((Settings!$B$2)+1),$F78*$E$9*((Settings!$B$2)+1)), IF($E78=\"USD\",$F78*((Settings!$B$2)+1),$F78*$E$9*((Settings!$B$2)+1))),””),\"\")","v":""},{"$f":"IFERROR(IF($F78>0,$AA78*(1-Settings!$B$3),\"\"),\"\")","v":""},"",null,null,null,null,"","","",0,"",0,0,{"$f":"IF($C78<>\"\",GetStockNumParam($C78,\"h\"),\"\")","v":""},0,"",""]
["",null,null,null,null,null,null,null,null,null,null,"","","","","",{"$f":"IFERROR(IF($F79>0,IF($B$6=\"Canada\",IF($E79=\"CAD\",$F79*((Settings!$B$2)+1),$F79*$E$9*((Settings!$B$2)+1)), IF($E79=\"USD\",$F79*((Settings!$B$2)+1),$F79*$E$9*((Settings!$B$2)+1))),””),\"\")","v":""},{"$f":"IFERROR(IF($F79>0,$AA79*(1-Settings!$B$3),\"\"),\"\")","v":""},"",null,null,null,null,"","","",0,"",0,0,{"$f":"IF($C79<>\"\",GetStockNumParam($C79,\"h\"),\"\")","v":""},0,"",""]
["",null,null,null,null,null,null,null,null,null,null,"","","","","",{"$f":"IFERROR(IF($F80>0,IF($B$6=\"Canada\",IF($E80=\"CAD\",$F80*((Settings!$B$2)+1),$F80*$E$9*((Settings!$B$2)+1)), IF($E80=\"USD\",$F80*((Settings!$B$2)+1),$F80*$E$9*((Settings!$B$2)+1))),””),\"\")","v":""},{"$f":"IFERROR(IF($F80>0,$AA80*(1-Settings!$B$3),\"\"),\"\")","v":""},"",null,null,null,null,"","","",0,"",0,0,{"$f":"IF($C80<>\"\",GetStockNumParam($C80,\"h\"),\"\")","v":""},0,"",""]
["",null,null,null,null,null,null,null,null,null,null,"","","","","",{"$f":"IFERROR(IF($F81>0,IF($B$6=\"Canada\",IF($E81=\"CAD\",$F81*((Settings!$B$2)+1),$F81*$E$9*((Settings!$B$2)+1)), IF($E81=\"USD\",$F81*((Settings!$B$2)+1),$F81*$E$9*((Settings!$B$2)+1))),””),\"\")","v":""},{"$f":"IFERROR(IF($F81>0,$AA81*(1-Settings!$B$3),\"\"),\"\")","v":""},"",null,null,null,null,"","","",0,"",0,0,{"$f":"IF($C81<>\"\",GetStockNumParam($C81,\"h\"),\"\")","v":""},0,"",""]
["",null,null,null,null,null,null,null,null,null,null,"","","","","",{"$f":"IFERROR(IF($F82>0,IF($B$6=\"Canada\",IF($E82=\"CAD\",$F82*((Settings!$B$2)+1),$F82*$E$9*((Settings!$B$2)+1)), IF($E82=\"USD\",$F82*((Settings!$B$2)+1),$F82*$E$9*((Settings!$B$2)+1))),””),\"\")","v":""},{"$f":"IFERROR(IF($F82>0,$AA82*(1-Settings!$B$3),\"\"),\"\")","v":""},"",null,null,null,null,"","","",0,"",0,0,{"$f":"IF($C82<>\"\",GetStockNumParam($C82,\"h\"),\"\")","v":""},0,"",""]
["",null,null,null,null,null,null,null,null,null,null,"","","","","",{"$f":"IFERROR(IF($F83>0,IF($B$6=\"Canada\",IF($E83=\"CAD\",$F83*((Settings!$B$2)+1),$F83*$E$9*((Settings!$B$2)+1)), IF($E83=\"USD\",$F83*((Settings!$B$2)+1),$F83*$E$9*((Settings!$B$2)+1))),””),\"\")","v":""},{"$f":"IFERROR(IF($F83>0,$AA83*(1-Settings!$B$3),\"\"),\"\")","v":""},"",null,null,null,null,"","","",0,"",0,0,{"$f":"IF($C83<>\"\",GetStockNumParam($C83,\"h\"),\"\")","v":""},0,"",""]
["",null,null,null,null,null,null,null,null,null,null,"","","","","",{"$f":"IFERROR(IF($F84>0,IF($B$6=\"Canada\",IF($E84=\"CAD\",$F84*((Settings!$B$2)+1),$F84*$E$9*((Settings!$B$2)+1)), IF($E84=\"USD\",$F84*((Settings!$B$2)+1),$F84*$E$9*((Settings!$B$2)+1))),””),\"\")","v":""},{"$f":"IFERROR(IF($F84>0,$AA84*(1-Settings!$B$3),\"\"),\"\")","v":""},"",null,null,null,null,"","","",0,"",0,0,{"$f":"IF($C84<>\"\",GetStockNumParam($C84,\"h\"),\"\")","v":""},0,"",""]
["",null,null,null,null,null,null,null,null,null,null,"","","","","",{"$f":"IFERROR(IF($F85>0,IF($B$6=\"Canada\",IF($E85=\"CAD\",$F85*((Settings!$B$2)+1),$F85*$E$9*((Settings!$B$2)+1)), IF($E85=\"USD\",$F85*((Settings!$B$2)+1),$F85*$E$9*((Settings!$B$2)+1))),””),\"\")","v":""},{"$f":"IFERROR(IF($F85>0,$AA85*(1-Settings!$B$3),\"\"),\"\")","v":""},"",null,null,null,null,"","","",0,"",0,0,{"$f":"IF($C85<>\"\",GetStockNumParam($C85,\"h\"),\"\")","v":""},0,"",""]
["",null,null,null,null,null,null,null,null,null,null,"","","","","",{"$f":"IFERROR(IF($F86>0,IF($B$6=\"Canada\",IF($E86=\"CAD\",$F86*((Settings!$B$2)+1),$F86*$E$9*((Settings!$B$2)+1)), IF($E86=\"USD\",$F86*((Settings!$B$2)+1),$F86*$E$9*((Settings!$B$2)+1))),””),\"\")","v":""},{"$f":"IFERROR(IF($F86>0,$AA86*(1-Settings!$B$3),\"\"),\"\")","v":""},"",null,null,null,null,"","","",0,"",0,0,{"$f":"IF($C86<>\"\",GetStockNumParam($C86,\"h\"),\"\")","v":""},0,"",""]
["",null,null,null,null,null,null,null,null,null,null,"","","","","",{"$f":"IFERROR(IF($F87>0,IF($B$6=\"Canada\",IF($E87=\"CAD\",$F87*((Settings!$B$2)+1),$F87*$E$9*((Settings!$B$2)+1)), IF($E87=\"USD\",$F87*((Settings!$B$2)+1),$F87*$E$9*((Settings!$B$2)+1))),””),\"\")","v":""},{"$f":"IFERROR(IF($F87>0,$AA87*(1-Settings!$B$3),\"\"),\"\")","v":""},"",null,null,null,null,"","","",0,"",0,0,{"$f":"IF($C87<>\"\",GetStockNumParam($C87,\"h\"),\"\")","v":""},0,"",""]
["",null,null,null,null,null,null,null,null,null,null,"","","","","",{"$f":"IFERROR(IF($F88>0,IF($B$6=\"Canada\",IF($E88=\"CAD\",$F88*((Settings!$B$2)+1),$F88*$E$9*((Settings!$B$2)+1)), IF($E88=\"USD\",$F88*((Settings!$B$2)+1),$F88*$E$9*((Settings!$B$2)+1))),””),\"\")","v":""},{"$f":"IFERROR(IF($F88>0,$AA88*(1-Settings!$B$3),\"\"),\"\")","v":""},"",null,null,null,null,"","","",0,"",0,0,{"$f":"IF($C88<>\"\",GetStockNumParam($C88,\"h\"),\"\")","v":""},0,"",""]
["",null,null,null,null,null,null,null,null,null,null,"","","","","",{"$f":"IFERROR(IF($F89>0,IF($B$6=\"Canada\",IF($E89=\"CAD\",$F89*((Settings!$B$2)+1),$F89*$E$9*((Settings!$B$2)+1)), IF($E89=\"USD\",$F89*((Settings!$B$2)+1),$F89*$E$9*((Settings!$B$2)+1))),””),\"\")","v":""},{"$f":"IFERROR(IF($F89>0,$AA89*(1-Settings!$B$3),\"\"),\"\")","v":""},"",null,null,null,null,"","","",0,"",0,0,{"$f":"IF($C89<>\"\",GetStockNumParam($C89,\"h\"),\"\")","v":""},0,"",""]
["",null,null,null,null,null,null,null,null,null,null,"","","","","",{"$f":"IFERROR(IF($F90>0,IF($B$6=\"Canada\",IF($E90=\"CAD\",$F90*((Settings!$B$2)+1),$F90*$E$9*((Settings!$B$2)+1)), IF($E90=\"USD\",$F90*((Settings!$B$2)+1),$F90*$E$9*((Settings!$B$2)+1))),””),\"\")","v":""},{"$f":"IFERROR(IF($F90>0,$AA90*(1-Settings!$B$3),\"\"),\"\")","v":""},"",null,null,null,null,"","","",0,"",0,0,{"$f":"IF($C90<>\"\",GetStockNumParam($C90,\"h\"),\"\")","v":""},0,"",""]
["",null,null,null,null,null,null,null,null,null,null,"","","","","",{"$f":"IFERROR(IF($F91>0,IF($B$6=\"Canada\",IF($E91=\"CAD\",$F91*((Settings!$B$2)+1),$F91*$E$9*((Settings!$B$2)+1)), IF($E91=\"USD\",$F91*((Settings!$B$2)+1),$F91*$E$9*((Settings!$B$2)+1))),””),\"\")","v":""},{"$f":"IFERROR(IF($F91>0,$AA91*(1-Settings!$B$3),\"\"),\"\")","v":""},"",null,null,null,null,"","","",0,"",0,0,{"$f":"IF($C91<>\"\",GetStockNumParam($C91,\"h\"),\"\")","v":""},0,"",""]
["",null,null,null,null,null,null,null,null,null,null,"","","","","",{"$f":"IFERROR(IF($F92>0,IF($B$6=\"Canada\",IF($E92=\"CAD\",$F92*((Settings!$B$2)+1),$F92*$E$9*((Settings!$B$2)+1)), IF($E92=\"USD\",$F92*((Settings!$B$2)+1),$F92*$E$9*((Settings!$B$2)+1))),””),\"\")","v":""},{"$f":"IFERROR(IF($F92>0,$AA92*(1-Settings!$B$3),\"\"),\"\")","v":""},"",null,null,null,null,"","","",0,"",0,0,{"$f":"IF($C92<>\"\",GetStockNumParam($C92,\"h\"),\"\")","v":""},0,"",""]
["",null,null,null,null,null,null,null,null,null,null,"","","","","",{"$f":"IFERROR(IF($F93>0,IF($B$6=\"Canada\",IF($E93=\"CAD\",$F93*((Settings!$B$2)+1),$F93*$E$9*((Settings!$B$2)+1)), IF($E93=\"USD\",$F93*((Settings!$B$2)+1),$F93*$E$9*((Settings!$B$2)+1))),””),\"\")","v":""},{"$f":"IFERROR(IF($F93>0,$AA93*(1-Settings!$B$3),\"\"),\"\")","v":""},"",null,null,null,null,"","","",0,"",0,0,{"$f":"IF($C93<>\"\",GetStockNumParam($C93,\"h\"),\"\")","v":""},0,"",""]
["",null,null,null,null,null,null,null,null,null,null,"","","","","",{"$f":"IFERROR(IF($F94>0,IF($B$6=\"Canada\",IF($E94=\"CAD\",$F94*((Settings!$B$2)+1),$F94*$E$9*((Settings!$B$2)+1)), IF($E94=\"USD\",$F94*((Settings!$B$2)+1),$F94*$E$9*((Settings!$B$2)+1))),””),\"\")","v":""},{"$f":"IFERROR(IF($F94>0,$AA94*(1-Settings!$B$3),\"\"),\"\")","v":""},"",null,null,null,null,"","","",0,"",0,0,{"$f":"IF($C94<>\"\",GetStockNumParam($C94,\"h\"),\"\")","v":""},0,"",""]
["",null,null,null,null,null,null,null,null,null,null,"","","","","",{"$f":"IFERROR(IF($F95>0,IF($B$6=\"Canada\",IF($E95=\"CAD\",$F95*((Settings!$B$2)+1),$F95*$E$9*((Settings!$B$2)+1)), IF($E95=\"USD\",$F95*((Settings!$B$2)+1),$F95*$E$9*((Settings!$B$2)+1))),””),\"\")","v":""},{"$f":"IFERROR(IF($F95>0,$AA95*(1-Settings!$B$3),\"\"),\"\")","v":""},"",null,null,null,null,"","","",0,"",0,0,{"$f":"IF($C95<>\"\",GetStockNumParam($C95,\"h\"),\"\")","v":""},0,"",""]
["",null,null,null,null,null,null,null,null,null,null,"","","","","",{"$f":"IFERROR(IF($F96>0,IF($B$6=\"Canada\",IF($E96=\"CAD\",$F96*((Settings!$B$2)+1),$F96*$E$9*((Settings!$B$2)+1)), IF($E96=\"USD\",$F96*((Settings!$B$2)+1),$F96*$E$9*((Settings!$B$2)+1))),””),\"\")","v":""},{"$f":"IFERROR(IF($F96>0,$AA96*(1-Settings!$B$3),\"\"),\"\")","v":""},"",null,null,null,null,"","","",0,"",0,0,{"$f":"IF($C96<>\"\",GetStockNumParam($C96,\"h\"),\"\")","v":""},0,"",""]
["",null,null,null,null,null,null,null,null,null,null,"","","","","",{"$f":"IFERROR(IF($F97>0,IF($B$6=\"Canada\",IF($E97=\"CAD\",$F97*((Settings!$B$2)+1),$F97*$E$9*((Settings!$B$2)+1)), IF($E97=\"USD\",$F97*((Settings!$B$2)+1),$F97*$E$9*((Settings!$B$2)+1))),””),\"\")","v":""},{"$f":"IFERROR(IF($F97>0,$AA97*(1-Settings!$B$3),\"\"),\"\")","v":""},"",null,null,null,null,"","","",0,"",0,0,{"$f":"IF($C97<>\"\",GetStockNumParam($C97,\"h\"),\"\")","v":""},0,"",""]
["",null,null,null,null,null,null,null,null,null,null,"","","","","",{"$f":"IFERROR(IF($F98>0,IF($B$6=\"Canada\",IF($E98=\"CAD\",$F98*((Settings!$B$2)+1),$F98*$E$9*((Settings!$B$2)+1)), IF($E98=\"USD\",$F98*((Settings!$B$2)+1),$F98*$E$9*((Settings!$B$2)+1))),””),\"\")","v":""},{"$f":"IFERROR(IF($F98>0,$AA98*(1-Settings!$B$3),\"\"),\"\")","v":""},"",null,null,null,null,"","","",0,"",0,0,{"$f":"IF($C98<>\"\",GetStockNumParam($C98,\"h\"),\"\")","v":""},0,"",""]
["",null,null,null,null,null,null,null,null,null,null,"","","","","",{"$f":"IFERROR(IF($F99>0,IF($B$6=\"Canada\",IF($E99=\"CAD\",$F99*((Settings!$B$2)+1),$F99*$E$9*((Settings!$B$2)+1)), IF($E99=\"USD\",$F99*((Settings!$B$2)+1),$F99*$E$9*((Settings!$B$2)+1))),””),\"\")","v":""},{"$f":"IFERROR(IF($F99>0,$AA99*(1-Settings!$B$3),\"\"),\"\")","v":""},"",null,null,null,null,"","","",0,"",0,0,{"$f":"IF($C99<>\"\",GetStockNumParam($C99,\"h\"),\"\")","v":""},0,"",""]
["",null,null,null,null,null,null,null,null,null,null,"","","","","",{"$f":"IFERROR(IF($F100>0,IF($B$6=\"Canada\",IF($E100=\"CAD\",$F100*((Settings!$B$2)+1),$F100*$E$9*((Settings!$B$2)+1)), IF($E100=\"USD\",$F100*((Settings!$B$2)+1),$F100*$E$9*((Settings!$B$2)+1))),””),\"\")","v":""},{"$f":"IFERROR(IF($F100>0,$AA100*(1-Settings!$B$3),\"\"),\"\")","v":""},"",null,null,null,null,"","","",0,"",0,0,{"$f":"IF($C100<>\"\",GetStockNumParam($C100,\"h\"),\"\")","v":""},0,"",""]
["",null,null,null,null,null,null,null,null,null,null,"","","","","",{"$f":"IFERROR(IF($F101>0,IF($B$6=\"Canada\",IF($E101=\"CAD\",$F101*((Settings!$B$2)+1),$F101*$E$9*((Settings!$B$2)+1)), IF($E101=\"USD\",$F101*((Settings!$B$2)+1),$F101*$E$9*((Settings!$B$2)+1))),””),\"\")","v":""},{"$f":"IFERROR(IF($F101>0,$AA101*(1-Settings!$B$3),\"\"),\"\")","v":""},"",null,null,null,null,"","","",0,"",0,0,{"$f":"IF($C101<>\"\",GetStockNumParam($C101,\"h\"),\"\")","v":""},0,"",""]
["",null,null,null,null,null,null,null,null,null,null,"","","","","",{"$f":"IFERROR(IF($F102>0,IF($B$6=\"Canada\",IF($E102=\"CAD\",$F102*((Settings!$B$2)+1),$F102*$E$9*((Settings!$B$2)+1)), IF($E102=\"USD\",$F102*((Settings!$B$2)+1),$F102*$E$9*((Settings!$B$2)+1))),””),\"\")","v":""},{"$f":"IFERROR(IF($F102>0,$AA102*(1-Settings!$B$3),\"\"),\"\")","v":""},"",null,null,null,null,"","","",0,"",0,0,{"$f":"IF($C102<>\"\",GetStockNumParam($C102,\"h\"),\"\")","v":""},0,"",""]
["",null,null,null,null,null,null,null,null,null,null,"","","","","",{"$f":"IFERROR(IF($F103>0,IF($B$6=\"Canada\",IF($E103=\"CAD\",$F103*((Settings!$B$2)+1),$F103*$E$9*((Settings!$B$2)+1)), IF($E103=\"USD\",$F103*((Settings!$B$2)+1),$F103*$E$9*((Settings!$B$2)+1))),””),\"\")","v":""},{"$f":"IFERROR(IF($F103>0,$AA103*(1-Settings!$B$3),\"\"),\"\")","v":""},"",null,null,null,null,"","","",0,"",0,0,{"$f":"IF($C103<>\"\",GetStockNumParam($C103,\"h\"),\"\")","v":""},0,"",""]
["",null,null,null,null,null,null,null,null,null,null,"","","","","",{"$f":"IFERROR(IF($F104>0,IF($B$6=\"Canada\",IF($E104=\"CAD\",$F104*((Settings!$B$2)+1),$F104*$E$9*((Settings!$B$2)+1)), IF($E104=\"USD\",$F104*((Settings!$B$2)+1),$F104*$E$9*((Settings!$B$2)+1))),””),\"\")","v":""},{"$f":"IFERROR(IF($F104>0,$AA104*(1-Settings!$B$3),\"\"),\"\")","v":""},"",null,null,null,null,"","","",0,"",0,0,{"$f":"IF($C104<>\"\",GetStockNumParam($C104,\"h\"),\"\")","v":""},0,"",""]
["",null,null,null,null,null,null,null,null,null,null,"","","","","",{"$f":"IFERROR(IF($F105>0,IF($B$6=\"Canada\",IF($E105=\"CAD\",$F105*((Settings!$B$2)+1),$F105*$E$9*((Settings!$B$2)+1)), IF($E105=\"USD\",$F105*((Settings!$B$2)+1),$F105*$E$9*((Settings!$B$2)+1))),””),\"\")","v":""},{"$f":"IFERROR(IF($F105>0,$AA105*(1-Settings!$B$3),\"\"),\"\")","v":""},"",null,null,null,null,"","","",0,"",0,0,{"$f":"IF($C105<>\"\",GetStockNumParam($C105,\"h\"),\"\")","v":""},0,"",""]
["",null,null,null,null,null,null,null,null,null,null,"","","","","",{"$f":"IFERROR(IF($F106>0,IF($B$6=\"Canada\",IF($E106=\"CAD\",$F106*((Settings!$B$2)+1),$F106*$E$9*((Settings!$B$2)+1)), IF($E106=\"USD\",$F106*((Settings!$B$2)+1),$F106*$E$9*((Settings!$B$2)+1))),””),\"\")","v":""},{"$f":"IFERROR(IF($F106>0,$AA106*(1-Settings!$B$3),\"\"),\"\")","v":""},"",null,null,null,null,"","","",0,"",0,0,{"$f":"IF($C106<>\"\",GetStockNumParam($C106,\"h\"),\"\")","v":""},0,"",""]
["",null,null,null,null,null,null,null,null,null,null,"","","","","",{"$f":"IFERROR(IF($F107>0,IF($B$6=\"Canada\",IF($E107=\"CAD\",$F107*((Settings!$B$2)+1),$F107*$E$9*((Settings!$B$2)+1)), IF($E107=\"USD\",$F107*((Settings!$B$2)+1),$F107*$E$9*((Settings!$B$2)+1))),””),\"\")","v":""},{"$f":"IFERROR(IF($F107>0,$AA107*(1-Settings!$B$3),\"\"),\"\")","v":""},"",null,null,null,null,"","","",0,"",0,0,{"$f":"IF($C107<>\"\",GetStockNumParam($C107,\"h\"),\"\")","v":""},0,"",""]
["",null,null,null,null,null,null,null,null,null,null,"","","","","",{"$f":"IFERROR(IF($F108>0,IF($B$6=\"Canada\",IF($E108=\"CAD\",$F108*((Settings!$B$2)+1),$F108*$E$9*((Settings!$B$2)+1)), IF($E108=\"USD\",$F108*((Settings!$B$2)+1),$F108*$E$9*((Settings!$B$2)+1))),””),\"\")","v":""},{"$f":"IFERROR(IF($F108>0,$AA108*(1-Settings!$B$3),\"\"),\"\")","v":""},"",null,null,null,null,"","","",0,"",0,0,{"$f":"IF($C108<>\"\",GetStockNumParam($C108,\"h\"),\"\")","v":""},0,"",""]
["",null,null,null,null,null,null,null,null,null,null,"","","","","",{"$f":"IFERROR(IF($F109>0,IF($B$6=\"Canada\",IF($E109=\"CAD\",$F109*((Settings!$B$2)+1),$F109*$E$9*((Settings!$B$2)+1)), IF($E109=\"USD\",$F109*((Settings!$B$2)+1),$F109*$E$9*((Settings!$B$2)+1))),””),\"\")","v":""},{"$f":"IFERROR(IF($F109>0,$AA109*(1-Settings!$B$3),\"\"),\"\")","v":""},"",null,null,null,null,"","","",0,"",0,0,{"$f":"IF($C109<>\"\",GetStockNumParam($C109,\"h\"),\"\")","v":""},0,"",""]
["",null,null,null,null,null,null,null,null,null,null,"","","","","",{"$f":"IFERROR(IF($F110>0,IF($B$6=\"Canada\",IF($E110=\"CAD\",$F110*((Settings!$B$2)+1),$F110*$E$9*((Settings!$B$2)+1)), IF($E110=\"USD\",$F110*((Settings!$B$2)+1),$F110*$E$9*((Settings!$B$2)+1))),””),\"\")","v":""},{"$f":"IFERROR(IF($F110>0,$AA110*(1-Settings!$B$3),\"\"),\"\")","v":""},"",null,null,null,null,"","","",0,"",0,0,{"$f":"IF($C110<>\"\",GetStockNumParam($C110,\"h\"),\"\")","v":""},0,"",""]
["",null,null,null,null,null,null,null,null,null,null,"","","","","",{"$f":"IFERROR(IF($F111>0,IF($B$6=\"Canada\",IF($E111=\"CAD\",$F111*((Settings!$B$2)+1),$F111*$E$9*((Settings!$B$2)+1)), IF($E111=\"USD\",$F111*((Settings!$B$2)+1),$F111*$E$9*((Settings!$B$2)+1))),””),\"\")","v":""},{"$f":"IFERROR(IF($F111>0,$AA111*(1-Settings!$B$3),\"\"),\"\")","v":""},"",null,null,null,null,"","","",0,"",0,0,{"$f":"IF($C111<>\"\",GetStockNumParam($C111,\"h\"),\"\")","v":""},0,"",""]
["",null,null,null,null,null,null,null,null,null,null,"","","","","",{"$f":"IFERROR(IF($F112>0,IF($B$6=\"Canada\",IF($E112=\"CAD\",$F112*((Settings!$B$2)+1),$F112*$E$9*((Settings!$B$2)+1)), IF($E112=\"USD\",$F112*((Settings!$B$2)+1),$F112*$E$9*((Settings!$B$2)+1))),””),\"\")","v":""},{"$f":"IFERROR(IF($F112>0,$AA112*(1-Settings!$B$3),\"\"),\"\")","v":""},"",null,null,null,null,"","","",0,"",0,0,{"$f":"IF($C112<>\"\",GetStockNumParam($C112,\"h\"),\"\")","v":""},0,"",""]
["",null,null,null,null,null,null,null,null,null,null,"","","","","",{"$f":"IFERROR(IF($F113>0,IF($B$6=\"Canada\",IF($E113=\"CAD\",$F113*((Settings!$B$2)+1),$F113*$E$9*((Settings!$B$2)+1)), IF($E113=\"USD\",$F113*((Settings!$B$2)+1),$F113*$E$9*((Settings!$B$2)+1))),””),\"\")","v":""},{"$f":"IFERROR(IF($F113>0,$AA113*(1-Settings!$B$3),\"\"),\"\")","v":""},"",null,null,null,null,"","","",0,"",0,0,{"$f":"IF($C113<>\"\",GetStockNumParam($C113,\"h\"),\"\")","v":""},0,"",""]
["",null,null,null,null,null,null,null,null,null,null,"","","","","",{"$f":"IFERROR(IF($F114>0,IF($B$6=\"Canada\",IF($E114=\"CAD\",$F114*((Settings!$B$2)+1),$F114*$E$9*((Settings!$B$2)+1)), IF($E114=\"USD\",$F114*((Settings!$B$2)+1),$F114*$E$9*((Settings!$B$2)+1))),””),\"\")","v":""},{"$f":"IFERROR(IF($F114>0,$AA114*(1-Settings!$B$3),\"\"),\"\")","v":""},"",null,null,null,null,"","","",0,"",0,0,{"$f":"IF($C114<>\"\",GetStockNumParam($C114,\"h\"),\"\")","v":""},0,"",""]
["",null,null,null,null,null,null,null,null,null,null,"","","","","",{"$f":"IFERROR(IF($F115>0,IF($B$6=\"Canada\",IF($E115=\"CAD\",$F115*((Settings!$B$2)+1),$F115*$E$9*((Settings!$B$2)+1)), IF($E115=\"USD\",$F115*((Settings!$B$2)+1),$F115*$E$9*((Settings!$B$2)+1))),””),\"\")","v":""},{"$f":"IFERROR(IF($F115>0,$AA115*(1-Settings!$B$3),\"\"),\"\")","v":""},"",null,null,null,null,"","","",0,"",0,0,{"$f":"IF($C115<>\"\",GetStockNumParam($C115,\"h\"),\"\")","v":""},0,"",""]
["",null,null,null,null,null,null,null,null,null,null,"","","","","",{"$f":"IFERROR(IF($F116>0,IF($B$6=\"Canada\",IF($E116=\"CAD\",$F116*((Settings!$B$2)+1),$F116*$E$9*((Settings!$B$2)+1)), IF($E116=\"USD\",$F116*((Settings!$B$2)+1),$F116*$E$9*((Settings!$B$2)+1))),””),\"\")","v":""},{"$f":"IFERROR(IF($F116>0,$AA116*(1-Settings!$B$3),\"\"),\"\")","v":""},"",null,null,null,null,"","","",0,"",0,0,{"$f":"IF($C116<>\"\",GetStockNumParam($C116,\"h\"),\"\")","v":""},0,"",""]
["",null,null,null,null,null,null,null,null,null,null,"","","","","",{"$f":"IFERROR(IF($F117>0,IF($B$6=\"Canada\",IF($E117=\"CAD\",$F117*((Settings!$B$2)+1),$F117*$E$9*((Settings!$B$2)+1)), IF($E117=\"USD\",$F117*((Settings!$B$2)+1),$F117*$E$9*((Settings!$B$2)+1))),””),\"\")","v":""},{"$f":"IFERROR(IF($F117>0,$AA117*(1-Settings!$B$3),\"\"),\"\")","v":""},"",null,null,null,null,"","","",0,"",0,0,{"$f":"IF($C117<>\"\",GetStockNumParam($C117,\"h\"),\"\")","v":""},0,"",""]
["",null,null,null,null,null,null,null,null,null,null,"","","","","",{"$f":"IFERROR(IF($F118>0,IF($B$6=\"Canada\",IF($E118=\"CAD\",$F118*((Settings!$B$2)+1),$F118*$E$9*((Settings!$B$2)+1)), IF($E118=\"USD\",$F118*((Settings!$B$2)+1),$F118*$E$9*((Settings!$B$2)+1))),””),\"\")","v":""},{"$f":"IFERROR(IF($F118>0,$AA118*(1-Settings!$B$3),\"\"),\"\")","v":""},"",null,null,null,null,"","","",0,"",0,0,{"$f":"IF($C118<>\"\",GetStockNumParam($C118,\"h\"),\"\")","v":""},0,"",""]
["",null,null,null,null,null,null,null,null,null,null,"","","","","",{"$f":"IFERROR(IF($F119>0,IF($B$6=\"Canada\",IF($E119=\"CAD\",$F119*((Settings!$B$2)+1),$F119*$E$9*((Settings!$B$2)+1)), IF($E119=\"USD\",$F119*((Settings!$B$2)+1),$F119*$E$9*((Settings!$B$2)+1))),””),\"\")","v":""},{"$f":"IFERROR(IF($F119>0,$AA119*(1-Settings!$B$3),\"\"),\"\")","v":""},"",null,null,null,null,"","","",0,"",0,0,{"$f":"IF($C119<>\"\",GetStockNumParam($C119,\"h\"),\"\")","v":""},0,"",""]
["",null,null,null,null,null,null,null,null,null,null,"","","","","",{"$f":"IFERROR(IF($F120>0,IF($B$6=\"Canada\",IF($E120=\"CAD\",$F120*((Settings!$B$2)+1),$F120*$E$9*((Settings!$B$2)+1)), IF($E120=\"USD\",$F120*((Settings!$B$2)+1),$F120*$E$9*((Settings!$B$2)+1))),””),\"\")","v":""},{"$f":"IFERROR(IF($F120>0,$AA120*(1-Settings!$B$3),\"\"),\"\")","v":""},"",null,null,null,null,"","","",0,"",0,0,{"$f":"IF($C120<>\"\",GetStockNumParam($C120,\"h\"),\"\")","v":""},0,"",""]
["",null,null,null,null,null,null,null,null,null,null,"","","","","",{"$f":"IFERROR(IF($F121>0,IF($B$6=\"Canada\",IF($E121=\"CAD\",$F121*((Settings!$B$2)+1),$F121*$E$9*((Settings!$B$2)+1)), IF($E121=\"USD\",$F121*((Settings!$B$2)+1),$F121*$E$9*((Settings!$B$2)+1))),””),\"\")","v":""},{"$f":"IFERROR(IF($F121>0,$AA121*(1-Settings!$B$3),\"\"),\"\")","v":""},"",null,null,null,null,"","","",0,"",0,0,{"$f":"IF($C121<>\"\",GetStockNumParam($C121,\"h\"),\"\")","v":""},0,"",""]
["",null,null,null,null,null,null,null,null,null,null,"","","","","",{"$f":"IFERROR(IF($F122>0,IF($B$6=\"Canada\",IF($E122=\"CAD\",$F122*((Settings!$B$2)+1),$F122*$E$9*((Settings!$B$2)+1)), IF($E122=\"USD\",$F122*((Settings!$B$2)+1),$F122*$E$9*((Settings!$B$2)+1))),””),\"\")","v":""},{"$f":"IFERROR(IF($F122>0,$AA122*(1-Settings!$B$3),\"\"),\"\")","v":""},"",null,null,null,null,"","","",0,"",0,0,{"$f":"IF($C122<>\"\",GetStockNumParam($C122,\"h\"),\"\")","v":""},0,"",""]
["",null,null,null,null,null,null,null,null,null,null,"","","","","",{"$f":"IFERROR(IF($F123>0,IF($B$6=\"Canada\",IF($E123=\"CAD\",$F123*((Settings!$B$2)+1),$F123*$E$9*((Settings!$B$2)+1)), IF($E123=\"USD\",$F123*((Settings!$B$2)+1),$F123*$E$9*((Settings!$B$2)+1))),””),\"\")","v":""},{"$f":"IFERROR(IF($F123>0,$AA123*(1-Settings!$B$3),\"\"),\"\")","v":""},"",null,null,null,null,"","","",0,"",0,0,{"$f":"IF($C123<>\"\",GetStockNumParam($C123,\"h\"),\"\")","v":""},0,"",""]
["",null,null,null,null,null,null,null,null,null,null,"","","","","",{"$f":"IFERROR(IF($F124>0,IF($B$6=\"Canada\",IF($E124=\"CAD\",$F124*((Settings!$B$2)+1),$F124*$E$9*((Settings!$B$2)+1)), IF($E124=\"USD\",$F124*((Settings!$B$2)+1),$F124*$E$9*((Settings!$B$2)+1))),””),\"\")","v":""},{"$f":"IFERROR(IF($F124>0,$AA124*(1-Settings!$B$3),\"\"),\"\")","v":""},"",null,null,null,null,"","","",0,"",0,0,{"$f":"IF($C124<>\"\",GetStockNumParam($C124,\"h\"),\"\")","v":""},0,"",""]
["",null,null,null,null,null,null,null,null,null,null,"","","","","",{"$f":"IFERROR(IF($F125>0,IF($B$6=\"Canada\",IF($E125=\"CAD\",$F125*((Settings!$B$2)+1),$F125*$E$9*((Settings!$B$2)+1)), IF($E125=\"USD\",$F125*((Settings!$B$2)+1),$F125*$E$9*((Settings!$B$2)+1))),””),\"\")","v":""},{"$f":"IFERROR(IF($F125>0,$AA125*(1-Settings!$B$3),\"\"),\"\")","v":""},"",null,null,null,null,"","","",0,"",0,0,{"$f":"IF($C125<>\"\",GetStockNumParam($C125,\"h\"),\"\")","v":""},0,"",""]
["",null,null,null,null,null,null,null,null,null,null,"","","","","",{"$f":"IFERROR(IF($F126>0,IF($B$6=\"Canada\",IF($E126=\"CAD\",$F126*((Settings!$B$2)+1),$F126*$E$9*((Settings!$B$2)+1)), IF($E126=\"USD\",$F126*((Settings!$B$2)+1),$F126*$E$9*((Settings!$B$2)+1))),””),\"\")","v":""},{"$f":"IFERROR(IF($F126>0,$AA126*(1-Settings!$B$3),\"\"),\"\")","v":""},"",null,null,null,null,"","","",0,"",0,0,{"$f":"IF($C126<>\"\",GetStockNumParam($C126,\"h\"),\"\")","v":""},0,"",""]
["",null,null,null,null,null,null,null,null,null,null,"","","","","",{"$f":"IFERROR(IF($F127>0,IF($B$6=\"Canada\",IF($E127=\"CAD\",$F127*((Settings!$B$2)+1),$F127*$E$9*((Settings!$B$2)+1)), IF($E127=\"USD\",$F127*((Settings!$B$2)+1),$F127*$E$9*((Settings!$B$2)+1))),””),\"\")","v":""},{"$f":"IFERROR(IF($F127>0,$AA127*(1-Settings!$B$3),\"\"),\"\")","v":""},"",null,null,null,null,"","","",0,"",0,0,{"$f":"IF($C127<>\"\",GetStockNumParam($C127,\"h\"),\"\")","v":""},0,"",""]
["",null,null,null,null,null,null,null,null,null,null,"","","","","",{"$f":"IFERROR(IF($F128>0,IF($B$6=\"Canada\",IF($E128=\"CAD\",$F128*((Settings!$B$2)+1),$F128*$E$9*((Settings!$B$2)+1)), IF($E128=\"USD\",$F128*((Settings!$B$2)+1),$F128*$E$9*((Settings!$B$2)+1))),””),\"\")","v":""},{"$f":"IFERROR(IF($F128>0,$AA128*(1-Settings!$B$3),\"\"),\"\")","v":""},"",null,null,null,null,"","","",0,"",0,0,{"$f":"IF($C128<>\"\",GetStockNumParam($C128,\"h\"),\"\")","v":""},0,"",""]
["",null,null,null,null,null,null,null,null,null,null,"","","","","",{"$f":"IFERROR(IF($F129>0,IF($B$6=\"Canada\",IF($E129=\"CAD\",$F129*((Settings!$B$2)+1),$F129*$E$9*((Settings!$B$2)+1)), IF($E129=\"USD\",$F129*((Settings!$B$2)+1),$F129*$E$9*((Settings!$B$2)+1))),””),\"\")","v":""},{"$f":"IFERROR(IF($F129>0,$AA129*(1-Settings!$B$3),\"\"),\"\")","v":""},"",null,null,null,null,"","","",0,"",0,0,{"$f":"IF($C129<>\"\",GetStockNumParam($C129,\"h\"),\"\")","v":""},0,"",""]
["",null,null,null,null,null,null,null,null,null,null,"","","","","",{"$f":"IFERROR(IF($F130>0,IF($B$6=\"Canada\",IF($E130=\"CAD\",$F130*((Settings!$B$2)+1),$F130*$E$9*((Settings!$B$2)+1)), IF($E130=\"USD\",$F130*((Settings!$B$2)+1),$F130*$E$9*((Settings!$B$2)+1))),””),\"\")","v":""},{"$f":"IFERROR(IF($F130>0,$AA130*(1-Settings!$B$3),\"\"),\"\")","v":""},"",null,null,null,null,"","","",0,"",0,0,{"$f":"IF($C130<>\"\",GetStockNumParam($C130,\"h\"),\"\")","v":""},0,"",""]
["",null,null,null,null,null,null,null,null,null,null,"","","","","",{"$f":"IFERROR(IF($F131>0,IF($B$6=\"Canada\",IF($E131=\"CAD\",$F131*((Settings!$B$2)+1),$F131*$E$9*((Settings!$B$2)+1)), IF($E131=\"USD\",$F131*((Settings!$B$2)+1),$F131*$E$9*((Settings!$B$2)+1))),””),\"\")","v":""},{"$f":"IFERROR(IF($F131>0,$AA131*(1-Settings!$B$3),\"\"),\"\")","v":""},"",null,null,null,null,"","","",0,"",0,0,{"$f":"IF($C131<>\"\",GetStockNumParam($C131,\"h\"),\"\")","v":""},0,"",""]
["",null,null,null,null,null,null,null,null,null,null,"","","","","",{"$f":"IFERROR(IF($F132>0,IF($B$6=\"Canada\",IF($E132=\"CAD\",$F132*((Settings!$B$2)+1),$F132*$E$9*((Settings!$B$2)+1)), IF($E132=\"USD\",$F132*((Settings!$B$2)+1),$F132*$E$9*((Settings!$B$2)+1))),””),\"\")","v":""},{"$f":"IFERROR(IF($F132>0,$AA132*(1-Settings!$B$3),\"\"),\"\")","v":""},"",null,null,null,null,"","","",0,"",0,0,{"$f":"IF($C132<>\"\",GetStockNumParam($C132,\"h\"),\"\")","v":""},0,"",""]
["",null,null,null,null,null,null,null,null,null,null,"","","","","",{"$f":"IFERROR(IF($F133>0,IF($B$6=\"Canada\",IF($E133=\"CAD\",$F133*((Settings!$B$2)+1),$F133*$E$9*((Settings!$B$2)+1)), IF($E133=\"USD\",$F133*((Settings!$B$2)+1),$F133*$E$9*((Settings!$B$2)+1))),””),\"\")","v":""},{"$f":"IFERROR(IF($F133>0,$AA133*(1-Settings!$B$3),\"\"),\"\")","v":""},"",null,null,null,null,"","","",0,"",0,0,{"$f":"IF($C133<>\"\",GetStockNumParam($C133,\"h\"),\"\")","v":""},0,"",""]
["",null,null,null,null,null,null,null,null,null,null,"","","","","",{"$f":"IFERROR(IF($F134>0,IF($B$6=\"Canada\",IF($E134=\"CAD\",$F134*((Settings!$B$2)+1),$F134*$E$9*((Settings!$B$2)+1)), IF($E134=\"USD\",$F134*((Settings!$B$2)+1),$F134*$E$9*((Settings!$B$2)+1))),””),\"\")","v":""},{"$f":"IFERROR(IF($F134>0,$AA134*(1-Settings!$B$3),\"\"),\"\")","v":""},"",null,null,null,null,"","","",0,"",0,0,{"$f":"IF($C134<>\"\",GetStockNumParam($C134,\"h\"),\"\")","v":""},0,"",""]
["",null,null,null,null,null,null,null,null,null,null,"","","","","",{"$f":"IFERROR(IF($F135>0,IF($B$6=\"Canada\",IF($E135=\"CAD\",$F135*((Settings!$B$2)+1),$F135*$E$9*((Settings!$B$2)+1)), IF($E135=\"USD\",$F135*((Settings!$B$2)+1),$F135*$E$9*((Settings!$B$2)+1))),””),\"\")","v":""},{"$f":"IFERROR(IF($F135>0,$AA135*(1-Settings!$B$3),\"\"),\"\")","v":""},"",null,null,null,null,"","","",0,"",0,0,{"$f":"IF($C135<>\"\",GetStockNumParam($C135,\"h\"),\"\")","v":""},0,"",""]
["",null,null,null,null,null,null,null,null,null,null,"","","","","",{"$f":"IFERROR(IF($F136>0,IF($B$6=\"Canada\",IF($E136=\"CAD\",$F136*((Settings!$B$2)+1),$F136*$E$9*((Settings!$B$2)+1)), IF($E136=\"USD\",$F136*((Settings!$B$2)+1),$F136*$E$9*((Settings!$B$2)+1))),””),\"\")","v":""},{"$f":"IFERROR(IF($F136>0,$AA136*(1-Settings!$B$3),\"\"),\"\")","v":""},"",null,null,null,null,"","","",0,"",0,0,{"$f":"IF($C136<>\"\",GetStockNumParam($C136,\"h\"),\"\")","v":""},0,"",""]
["",null,null,null,null,null,null,null,null,null,null,"","","","","",{"$f":"IFERROR(IF($F137>0,IF($B$6=\"Canada\",IF($E137=\"CAD\",$F137*((Settings!$B$2)+1),$F137*$E$9*((Settings!$B$2)+1)), IF($E137=\"USD\",$F137*((Settings!$B$2)+1),$F137*$E$9*((Settings!$B$2)+1))),””),\"\")","v":""},{"$f":"IFERROR(IF($F137>0,$AA137*(1-Settings!$B$3),\"\"),\"\")","v":""},"",null,null,null,null,"","","",0,"",0,0,{"$f":"IF($C137<>\"\",GetStockNumParam($C137,\"h\"),\"\")","v":""},0,"",""]
["",null,null,null,null,null,null,null,null,null,null,"","","","","",{"$f":"IFERROR(IF($F138>0,IF($B$6=\"Canada\",IF($E138=\"CAD\",$F138*((Settings!$B$2)+1),$F138*$E$9*((Settings!$B$2)+1)), IF($E138=\"USD\",$F138*((Settings!$B$2)+1),$F138*$E$9*((Settings!$B$2)+1))),””),\"\")","v":""},{"$f":"IFERROR(IF($F138>0,$AA138*(1-Settings!$B$3),\"\"),\"\")","v":""},"",null,null,null,null,"","","",0,"",0,0,{"$f":"IF($C138<>\"\",GetStockNumParam($C138,\"h\"),\"\")","v":""},0,"",""]
["",null,null,null,null,null,null,null,null,null,null,"","",{"$f":"IF(D139 > 0,IF(T139 > 0,\"SOLD\",D139*K139),\"\")","v":""},{"$f":"IF(D139 > 0,IF(T139 > 0, Z139-I139, N139-I139),\"\")","v":""},{"$f":"IF(D139 > 0,IF(O139=0,0,(O139/I139)),\"\")","v":""},{"$f":"IFERROR(IF($F139>0,IF($B$6=\"Canada\",IF($E139=\"CAD\",$F139*((Settings!$B$2)+1),$F139*$E$9*((Settings!$B$2)+1)), IF($E139=\"USD\",$F139*((Settings!$B$2)+1),$F139*$E$9*((Settings!$B$2)+1))),””),\"\")","v":""},{"$f":"IFERROR(IF($F139>0,$AA139*(1-Settings!$B$3),\"\"),\"\")","v":""},{"$f":"IF(F139>0,IF(K139>=Q139,\"SELL\",IF(K139<=R139,\"STOP\",\"HOLD\")),\"\")","v":""},null,null,null,null,{"$f":"IF(D139 > 0,IF(Z139 = 0,0,Z139-I139),\"\")","v":""},{"$f":"IF(D139 > 0,IF(Z139=0,0,(Z139/I139)-100%),\"\")","v":""},{"$f":"IF(T139 > 0,T139*D139-V139+W139,N139)","v":""},0,"",0,{"$f":"IF(N139 = \"SOLD\", Z139-I139,I139)","v":0},{"$f":"IF($C139<>\"\",GetStockNumParam($C139,\"h\"),\"\")","v":""},0,"",""]
[{"$f":"IF($C140=\"\",\"\",GetName($C140))","v":""},null,null,null,null,null,null,null,null,null,null,{"$f":"IF(J140 > 0,K140-J140,\"\")","v":""},{"$f":"IF(J140 > 0,(L140/J140),\"\")","v":""},"","","",{"$f":"IFERROR(IF($F140>0,IF($B$6=\"Canada\",IF($E140=\"CAD\",$F140*((Settings!$B$2)+1),$F140*$E$9*((Settings!$B$2)+1)), IF($E140=\"USD\",$F140*((Settings!$B$2)+1),$F140*$E$9*((Settings!$B$2)+1))),””),\"\")","v":""},{"$f":"IFERROR(IF($F140>0,$AA140*(1-Settings!$B$3),\"\"),\"\")","v":""},"",null,null,null,null,"","","",{"$f":"IF($B$6=\"Canada\",\nIF($E140=\"CAD\",IF($F140>$K140,$F140,$K140),IF(($F140*$E$9)>$K140,($F140*$E$9),$K140)),\nIF($E140=\"CAD\",IF(($F140*$E$9)>$K140,($F140*$E$9),$K140),IF($F140>$K140,$F140,$K140)))","v":0},{"$f":"IF($B140=\"Simulate\",0,IF(N140 = \"SOLD\", 0, N140))","v":""},{"$f":"IF($B140=\"Simulate\",0,IF(N140 = \"SOLD\",0,I140))","v":0},0,{"$f":"IF($C140<>\"\",GetStockNumParam($C140,\"h\"),\"\")","v":""},{"$f":"IF($B140=\"Simulate\",0,$I140)","v":0},{"$f":"IF($B140=\"Simulate\",0,Z140)","v":""},{"$f":"IF($B140=\"Simulate\",\"\",$O140)","v":""}]
["",null,null,null,null,null,null,null,null,null,null,"","","","","",{"$f":"IFERROR(IF($F141>0,IF($B$6=\"Canada\",IF($E141=\"CAD\",$F141*((Settings!$B$2)+1),$F141*$E$9*((Settings!$B$2)+1)), IF($E141=\"USD\",$F141*((Settings!$B$2)+1),$F141*$E$9*((Settings!$B$2)+1))),””),\"\")","v":""},{"$f":"IFERROR(IF($F141>0,$AA141*(1-Settings!$B$3),\"\"),\"\")","v":""},"",null,null,null,null,"","","",0,"",0,0,{"$f":"IF($C141<>\"\",GetStockNumParam($C141,\"h\"),\"\")","v":""},0,"",""]
["",null,null,null,null,null,null,null,null,null,null,"","","","","",{"$f":"IFERROR(IF($F142>0,IF($B$6=\"Canada\",IF($E142=\"CAD\",$F142*((Settings!$B$2)+1),$F142*$E$9*((Settings!$B$2)+1)), IF($E142=\"USD\",$F142*((Settings!$B$2)+1),$F142*$E$9*((Settings!$B$2)+1))),””),\"\")","v":""},{"$f":"IFERROR(IF($F142>0,$AA142*(1-Settings!$B$3),\"\"),\"\")","v":""},"",null,null,null,null,"","","",0,"",0,0,{"$f":"IF($C142<>\"\",GetStockNumParam($C142,\"h\"),\"\")","v":""},0,"",""]
["",null,null,null,null,null,null,null,null,null,null,"","","","","",{"$f":"IFERROR(IF($F143>0,IF($B$6=\"Canada\",IF($E143=\"CAD\",$F143*((Settings!$B$2)+1),$F143*$E$9*((Settings!$B$2)+1)), IF($E143=\"USD\",$F143*((Settings!$B$2)+1),$F143*$E$9*((Settings!$B$2)+1))),””),\"\")","v":""},{"$f":"IFERROR(IF($F143>0,$AA143*(1-Settings!$B$3),\"\"),\"\")","v":""},"",null,null,null,null,"","","",0,"",0,0,{"$f":"IF($C143<>\"\",GetStockNumParam($C143,\"h\"),\"\")","v":""},0,"",""]
["",null,null,null,null,null,null,null,null,null,null,"","","","","",{"$f":"IFERROR(IF($F144>0,IF($B$6=\"Canada\",IF($E144=\"CAD\",$F144*((Settings!$B$2)+1),$F144*$E$9*((Settings!$B$2)+1)), IF($E144=\"USD\",$F144*((Settings!$B$2)+1),$F144*$E$9*((Settings!$B$2)+1))),””),\"\")","v":""},{"$f":"IFERROR(IF($F144>0,$AA144*(1-Settings!$B$3),\"\"),\"\")","v":""},"",null,null,null,null,"","","",0,"",0,0,{"$f":"IF($C144<>\"\",GetStockNumParam($C144,\"h\"),\"\")","v":""},0,"",""]
["",null,null,null,null,null,null,null,null,null,null,"","","","","",{"$f":"IFERROR(IF($F145>0,IF($B$6=\"Canada\",IF($E145=\"CAD\",$F145*((Settings!$B$2)+1),$F145*$E$9*((Settings!$B$2)+1)), IF($E145=\"USD\",$F145*((Settings!$B$2)+1),$F145*$E$9*((Settings!$B$2)+1))),””),\"\")","v":""},{"$f":"IFERROR(IF($F145>0,$AA145*(1-Settings!$B$3),\"\"),\"\")","v":""},"",null,null,null,null,"","","",0,"",0,0,{"$f":"IF($C145<>\"\",GetStockNumParam($C145,\"h\"),\"\")","v":""},0,"",""]
["",null,null,null,null,null,null,null,null,null,null,"","","","","",{"$f":"IFERROR(IF($F146>0,IF($B$6=\"Canada\",IF($E146=\"CAD\",$F146*((Settings!$B$2)+1),$F146*$E$9*((Settings!$B$2)+1)), IF($E146=\"USD\",$F146*((Settings!$B$2)+1),$F146*$E$9*((Settings!$B$2)+1))),””),\"\")","v":""},{"$f":"IFERROR(IF($F146>0,$AA146*(1-Settings!$B$3),\"\"),\"\")","v":""},"",null,null,null,null,"","","",0,"",0,0,{"$f":"IF($C146<>\"\",GetStockNumParam($C146,\"h\"),\"\")","v":""},0,"",""]
["",null,null,null,null,null,null,null,null,null,null,"","","","","",{"$f":"IFERROR(IF($F147>0,IF($B$6=\"Canada\",IF($E147=\"CAD\",$F147*((Settings!$B$2)+1),$F147*$E$9*((Settings!$B$2)+1)), IF($E147=\"USD\",$F147*((Settings!$B$2)+1),$F147*$E$9*((Settings!$B$2)+1))),””),\"\")","v":""},{"$f":"IFERROR(IF($F147>0,$AA147*(1-Settings!$B$3),\"\"),\"\")","v":""},"",null,null,null,null,"","","",0,"",0,0,{"$f":"IF($C147<>\"\",GetStockNumParam($C147,\"h\"),\"\")","v":""},0,"",""]
["",null,null,null,null,null,null,null,null,null,null,"","","","","",{"$f":"IFERROR(IF($F148>0,IF($B$6=\"Canada\",IF($E148=\"CAD\",$F148*((Settings!$B$2)+1),$F148*$E$9*((Settings!$B$2)+1)), IF($E148=\"USD\",$F148*((Settings!$B$2)+1),$F148*$E$9*((Settings!$B$2)+1))),””),\"\")","v":""},{"$f":"IFERROR(IF($F148>0,$AA148*(1-Settings!$B$3),\"\"),\"\")","v":""},"",null,null,null,null,"","","",0,"",0,0,{"$f":"IF($C148<>\"\",GetStockNumParam($C148,\"h\"),\"\")","v":""},0,"",""]
["",null,null,null,null,null,null,null,null,null,null,"","","","","",{"$f":"IFERROR(IF($F149>0,IF($B$6=\"Canada\",IF($E149=\"CAD\",$F149*((Settings!$B$2)+1),$F149*$E$9*((Settings!$B$2)+1)), IF($E149=\"USD\",$F149*((Settings!$B$2)+1),$F149*$E$9*((Settings!$B$2)+1))),””),\"\")","v":""},{"$f":"IFERROR(IF($F149>0,$AA149*(1-Settings!$B$3),\"\"),\"\")","v":""},"",null,null,null,null,"","","",0,"",0,0,{"$f":"IF($C149<>\"\",GetStockNumParam($C149,\"h\"),\"\")","v":""},0,"",""]
["",null,null,null,null,null,null,null,null,null,null,"","","","","",{"$f":"IFERROR(IF($F150>0,IF($B$6=\"Canada\",IF($E150=\"CAD\",$F150*((Settings!$B$2)+1),$F150*$E$9*((Settings!$B$2)+1)), IF($E150=\"USD\",$F150*((Settings!$B$2)+1),$F150*$E$9*((Settings!$B$2)+1))),””),\"\")","v":""},{"$f":"IFERROR(IF($F150>0,$AA150*(1-Settings!$B$3),\"\"),\"\")","v":""},"",null,null,null,null,"","","",0,"",0,0,{"$f":"IF($C150<>\"\",GetStockNumParam($C150,\"h\"),\"\")","v":""},0,"",""]
["",null,null,null,null,null,null,null,null,null,null,"","","","","",{"$f":"IFERROR(IF($F151>0,IF($B$6=\"Canada\",IF($E151=\"CAD\",$F151*((Settings!$B$2)+1),$F151*$E$9*((Settings!$B$2)+1)), IF($E151=\"USD\",$F151*((Settings!$B$2)+1),$F151*$E$9*((Settings!$B$2)+1))),””),\"\")","v":""},{"$f":"IFERROR(IF($F151>0,$AA151*(1-Settings!$B$3),\"\"),\"\")","v":""},"",null,null,null,null,"","","",0,"",0,0,{"$f":"IF($C151<>\"\",GetStockNumParam($C151,\"h\"),\"\")","v":""},0,"",""]
["",null,null,null,null,null,null,null,null,null,null,"","","","","",{"$f":"IFERROR(IF($F152>0,IF($B$6=\"Canada\",IF($E152=\"CAD\",$F152*((Settings!$B$2)+1),$F152*$E$9*((Settings!$B$2)+1)), IF($E152=\"USD\",$F152*((Settings!$B$2)+1),$F152*$E$9*((Settings!$B$2)+1))),””),\"\")","v":""},{"$f":"IFERROR(IF($F152>0,$AA152*(1-Settings!$B$3),\"\"),\"\")","v":""},"",null,null,null,null,"","","",0,"",0,0,{"$f":"IF($C152<>\"\",GetStockNumParam($C152,\"h\"),\"\")","v":""},0,"",""]
["",null,null,null,null,null,null,null,null,null,null,"","","","","",{"$f":"IFERROR(IF($F153>0,IF($B$6=\"Canada\",IF($E153=\"CAD\",$F153*((Settings!$B$2)+1),$F153*$E$9*((Settings!$B$2)+1)), IF($E153=\"USD\",$F153*((Settings!$B$2)+1),$F153*$E$9*((Settings!$B$2)+1))),””),\"\")","v":""},{"$f":"IFERROR(IF($F153>0,$AA153*(1-Settings!$B$3),\"\"),\"\")","v":""},"",null,null,null,null,"","","",0,"",0,0,{"$f":"IF($C153<>\"\",GetStockNumParam($C153,\"h\"),\"\")","v":""},0,"",""]
["",null,null,null,null,null,null,null,null,null,null,"","","","","",{"$f":"IFERROR(IF($F154>0,IF($B$6=\"Canada\",IF($E154=\"CAD\",$F154*((Settings!$B$2)+1),$F154*$E$9*((Settings!$B$2)+1)), IF($E154=\"USD\",$F154*((Settings!$B$2)+1),$F154*$E$9*((Settings!$B$2)+1))),””),\"\")","v":""},{"$f":"IFERROR(IF($F154>0,$AA154*(1-Settings!$B$3),\"\"),\"\")","v":""},"",null,null,null,null,"","","",0,"",0,0,{"$f":"IF($C154<>\"\",GetStockNumParam($C154,\"h\"),\"\")","v":""},0,"",""]
["",null,null,null,null,null,null,null,null,null,null,"","","","","",{"$f":"IFERROR(IF($F155>0,IF($B$6=\"Canada\",IF($E155=\"CAD\",$F155*((Settings!$B$2)+1),$F155*$E$9*((Settings!$B$2)+1)), IF($E155=\"USD\",$F155*((Settings!$B$2)+1),$F155*$E$9*((Settings!$B$2)+1))),””),\"\")","v":""},{"$f":"IFERROR(IF($F155>0,$AA155*(1-Settings!$B$3),\"\"),\"\")","v":""},"",null,null,null,null,"","","",0,"",0,0,{"$f":"IF($C155<>\"\",GetStockNumParam($C155,\"h\"),\"\")","v":""},0,"",""]
["",null,null,null,null,null,null,null,null,null,null,"","","","","",{"$f":"IFERROR(IF($F156>0,IF($B$6=\"Canada\",IF($E156=\"CAD\",$F156*((Settings!$B$2)+1),$F156*$E$9*((Settings!$B$2)+1)), IF($E156=\"USD\",$F156*((Settings!$B$2)+1),$F156*$E$9*((Settings!$B$2)+1))),””),\"\")","v":""},{"$f":"IFERROR(IF($F156>0,$AA156*(1-Settings!$B$3),\"\"),\"\")","v":""},"",null,null,null,null,"","","",0,"",0,0,{"$f":"IF($C156<>\"\",GetStockNumParam($C156,\"h\"),\"\")","v":""},0,"",""]
["",null,null,null,null,null,null,null,null,null,null,"","","","","",{"$f":"IFERROR(IF($F157>0,IF($B$6=\"Canada\",IF($E157=\"CAD\",$F157*((Settings!$B$2)+1),$F157*$E$9*((Settings!$B$2)+1)), IF($E157=\"USD\",$F157*((Settings!$B$2)+1),$F157*$E$9*((Settings!$B$2)+1))),””),\"\")","v":""},{"$f":"IFERROR(IF($F157>0,$AA157*(1-Settings!$B$3),\"\"),\"\")","v":""},"",null,null,null,null,"","","",0,"",0,0,{"$f":"IF($C157<>\"\",GetStockNumParam($C157,\"h\"),\"\")","v":""},0,"",""]
["",null,null,null,null,null,null,null,null,null,null,"","","","","",{"$f":"IFERROR(IF($F158>0,IF($B$6=\"Canada\",IF($E158=\"CAD\",$F158*((Settings!$B$2)+1),$F158*$E$9*((Settings!$B$2)+1)), IF($E158=\"USD\",$F158*((Settings!$B$2)+1),$F158*$E$9*((Settings!$B$2)+1))),””),\"\")","v":""},{"$f":"IFERROR(IF($F158>0,$AA158*(1-Settings!$B$3),\"\"),\"\")","v":""},"",null,null,null,null,"","","",0,"",0,0,{"$f":"IF($C158<>\"\",GetStockNumParam($C158,\"h\"),\"\")","v":""},0,"",""]
["",null,null,null,null,null,null,null,null,null,null,"","","","","",{"$f":"IFERROR(IF($F159>0,IF($B$6=\"Canada\",IF($E159=\"CAD\",$F159*((Settings!$B$2)+1),$F159*$E$9*((Settings!$B$2)+1)), IF($E159=\"USD\",$F159*((Settings!$B$2)+1),$F159*$E$9*((Settings!$B$2)+1))),””),\"\")","v":""},{"$f":"IFERROR(IF($F159>0,$AA159*(1-Settings!$B$3),\"\"),\"\")","v":""},"",null,null,null,null,"","","",0,"",0,0,{"$f":"IF($C159<>\"\",GetStockNumParam($C159,\"h\"),\"\")","v":""},0,"",""]
["",null,null,null,null,null,null,null,null,null,null,"","","","","",{"$f":"IFERROR(IF($F160>0,IF($B$6=\"Canada\",IF($E160=\"CAD\",$F160*((Settings!$B$2)+1),$F160*$E$9*((Settings!$B$2)+1)), IF($E160=\"USD\",$F160*((Settings!$B$2)+1),$F160*$E$9*((Settings!$B$2)+1))),””),\"\")","v":""},{"$f":"IFERROR(IF($F160>0,$AA160*(1-Settings!$B$3),\"\"),\"\")","v":""},"",null,null,null,null,"","","",0,"",0,0,{"$f":"IF($C160<>\"\",GetStockNumParam($C160,\"h\"),\"\")","v":""},0,"",""]
["",null,null,null,null,null,null,null,null,null,null,"","","","","",{"$f":"IFERROR(IF($F161>0,IF($B$6=\"Canada\",IF($E161=\"CAD\",$F161*((Settings!$B$2)+1),$F161*$E$9*((Settings!$B$2)+1)), IF($E161=\"USD\",$F161*((Settings!$B$2)+1),$F161*$E$9*((Settings!$B$2)+1))),””),\"\")","v":""},{"$f":"IFERROR(IF($F161>0,$AA161*(1-Settings!$B$3),\"\"),\"\")","v":""},"",null,null,null,null,"","","",0,"",0,0,{"$f":"IF($C161<>\"\",GetStockNumParam($C161,\"h\"),\"\")","v":""},0,"",""]
["",null,null,null,null,null,null,null,null,null,null,"","","","","",{"$f":"IFERROR(IF($F162>0,IF($B$6=\"Canada\",IF($E162=\"CAD\",$F162*((Settings!$B$2)+1),$F162*$E$9*((Settings!$B$2)+1)), IF($E162=\"USD\",$F162*((Settings!$B$2)+1),$F162*$E$9*((Settings!$B$2)+1))),””),\"\")","v":""},{"$f":"IFERROR(IF($F162>0,$AA162*(1-Settings!$B$3),\"\"),\"\")","v":""},"",null,null,null,null,"","","",0,"",0,0,{"$f":"IF($C162<>\"\",GetStockNumParam($C162,\"h\"),\"\")","v":""},0,"",""]
["",null,null,null,null,null,null,null,null,null,null,"","","","","",{"$f":"IFERROR(IF($F163>0,IF($B$6=\"Canada\",IF($E163=\"CAD\",$F163*((Settings!$B$2)+1),$F163*$E$9*((Settings!$B$2)+1)), IF($E163=\"USD\",$F163*((Settings!$B$2)+1),$F163*$E$9*((Settings!$B$2)+1))),””),\"\")","v":""},{"$f":"IFERROR(IF($F163>0,$AA163*(1-Settings!$B$3),\"\"),\"\")","v":""},"",null,null,null,null,"","","",0,"",0,0,{"$f":"IF($C163<>\"\",GetStockNumParam($C163,\"h\"),\"\")","v":""},0,"",""]
["",null,null,null,null,null,null,null,null,null,null,"","","","","",{"$f":"IFERROR(IF($F164>0,IF($B$6=\"Canada\",IF($E164=\"CAD\",$F164*((Settings!$B$2)+1),$F164*$E$9*((Settings!$B$2)+1)), IF($E164=\"USD\",$F164*((Settings!$B$2)+1),$F164*$E$9*((Settings!$B$2)+1))),””),\"\")","v":""},{"$f":"IFERROR(IF($F164>0,$AA164*(1-Settings!$B$3),\"\"),\"\")","v":""},"",null,null,null,null,"","","",0,"",0,0,{"$f":"IF($C164<>\"\",GetStockNumParam($C164,\"h\"),\"\")","v":""},0,"",""]
["",null,null,null,null,null,null,null,null,null,null,"","","","","",{"$f":"IFERROR(IF($F165>0,IF($B$6=\"Canada\",IF($E165=\"CAD\",$F165*((Settings!$B$2)+1),$F165*$E$9*((Settings!$B$2)+1)), IF($E165=\"USD\",$F165*((Settings!$B$2)+1),$F165*$E$9*((Settings!$B$2)+1))),””),\"\")","v":""},{"$f":"IFERROR(IF($F165>0,$AA165*(1-Settings!$B$3),\"\"),\"\")","v":""},"",null,null,null,null,"","","",0,"",0,0,{"$f":"IF($C165<>\"\",GetStockNumParam($C165,\"h\"),\"\")","v":""},0,"",""]
["",null,null,null,null,null,null,null,null,null,null,"","","","","",{"$f":"IFERROR(IF($F166>0,IF($B$6=\"Canada\",IF($E166=\"CAD\",$F166*((Settings!$B$2)+1),$F166*$E$9*((Settings!$B$2)+1)), IF($E166=\"USD\",$F166*((Settings!$B$2)+1),$F166*$E$9*((Settings!$B$2)+1))),””),\"\")","v":""},{"$f":"IFERROR(IF($F166>0,$AA166*(1-Settings!$B$3),\"\"),\"\")","v":""},"",null,null,null,null,"","","",0,"",0,0,{"$f":"IF($C166<>\"\",GetStockNumParam($C166,\"h\"),\"\")","v":""},0,"",""]
["",null,null,null,null,null,null,null,null,null,null,"","","","","",{"$f":"IFERROR(IF($F167>0,IF($B$6=\"Canada\",IF($E167=\"CAD\",$F167*((Settings!$B$2)+1),$F167*$E$9*((Settings!$B$2)+1)), IF($E167=\"USD\",$F167*((Settings!$B$2)+1),$F167*$E$9*((Settings!$B$2)+1))),””),\"\")","v":""},{"$f":"IFERROR(IF($F167>0,$AA167*(1-Settings!$B$3),\"\"),\"\")","v":""},"",null,null,null,null,"","","",0,"",0,0,{"$f":"IF($C167<>\"\",GetStockNumParam($C167,\"h\"),\"\")","v":""},0,"",""]
["",null,null,null,null,null,null,null,null,null,null,"","","","","",{"$f":"IFERROR(IF($F168>0,IF($B$6=\"Canada\",IF($E168=\"CAD\",$F168*((Settings!$B$2)+1),$F168*$E$9*((Settings!$B$2)+1)), IF($E168=\"USD\",$F168*((Settings!$B$2)+1),$F168*$E$9*((Settings!$B$2)+1))),””),\"\")","v":""},{"$f":"IFERROR(IF($F168>0,$AA168*(1-Settings!$B$3),\"\"),\"\")","v":""},"",null,null,null,null,"","","",0,"",0,0,{"$f":"IF($C168<>\"\",GetStockNumParam($C168,\"h\"),\"\")","v":""},0,"",""]
["",null,null,null,null,null,null,null,null,null,null,"","","","","",{"$f":"IFERROR(IF($F169>0,IF($B$6=\"Canada\",IF($E169=\"CAD\",$F169*((Settings!$B$2)+1),$F169*$E$9*((Settings!$B$2)+1)), IF($E169=\"USD\",$F169*((Settings!$B$2)+1),$F169*$E$9*((Settings!$B$2)+1))),””),\"\")","v":""},{"$f":"IFERROR(IF($F169>0,$AA169*(1-Settings!$B$3),\"\"),\"\")","v":""},"",null,null,null,null,"","","",0,"",0,0,{"$f":"IF($C169<>\"\",GetStockNumParam($C169,\"h\"),\"\")","v":""},0,"",""]
["",null,null,null,null,null,null,null,null,null,null,"","","","","",{"$f":"IFERROR(IF($F170>0,IF($B$6=\"Canada\",IF($E170=\"CAD\",$F170*((Settings!$B$2)+1),$F170*$E$9*((Settings!$B$2)+1)), IF($E170=\"USD\",$F170*((Settings!$B$2)+1),$F170*$E$9*((Settings!$B$2)+1))),””),\"\")","v":""},{"$f":"IFERROR(IF($F170>0,$AA170*(1-Settings!$B$3),\"\"),\"\")","v":""},"",null,null,null,null,"","","",0,"",0,0,{"$f":"IF($C170<>\"\",GetStockNumParam($C170,\"h\"),\"\")","v":""},0,"",""]
["",null,null,null,null,null,null,null,null,null,null,"","","","","",{"$f":"IFERROR(IF($F171>0,IF($B$6=\"Canada\",IF($E171=\"CAD\",$F171*((Settings!$B$2)+1),$F171*$E$9*((Settings!$B$2)+1)), IF($E171=\"USD\",$F171*((Settings!$B$2)+1),$F171*$E$9*((Settings!$B$2)+1))),””),\"\")","v":""},{"$f":"IFERROR(IF($F171>0,$AA171*(1-Settings!$B$3),\"\"),\"\")","v":""},"",null,null,null,null,"","","",0,"",0,0,{"$f":"IF($C171<>\"\",GetStockNumParam($C171,\"h\"),\"\")","v":""},0,"",""]
["",null,null,null,null,null,null,null,null,null,null,"","","","","",{"$f":"IFERROR(IF($F172>0,IF($B$6=\"Canada\",IF($E172=\"CAD\",$F172*((Settings!$B$2)+1),$F172*$E$9*((Settings!$B$2)+1)), IF($E172=\"USD\",$F172*((Settings!$B$2)+1),$F172*$E$9*((Settings!$B$2)+1))),””),\"\")","v":""},{"$f":"IFERROR(IF($F172>0,$AA172*(1-Settings!$B$3),\"\"),\"\")","v":""},"",null,null,null,null,"","","",0,"",0,0,{"$f":"IF($C172<>\"\",GetStockNumParam($C172,\"h\"),\"\")","v":""},0,"",""]
["",null,null,null,null,null,null,null,null,null,null,"","","","","",{"$f":"IFERROR(IF($F173>0,IF($B$6=\"Canada\",IF($E173=\"CAD\",$F173*((Settings!$B$2)+1),$F173*$E$9*((Settings!$B$2)+1)), IF($E173=\"USD\",$F173*((Settings!$B$2)+1),$F173*$E$9*((Settings!$B$2)+1))),””),\"\")","v":""},{"$f":"IFERROR(IF($F173>0,$AA173*(1-Settings!$B$3),\"\"),\"\")","v":""},"",null,null,null,null,"","","",0,"",0,0,{"$f":"IF($C173<>\"\",GetStockNumParam($C173,\"h\"),\"\")","v":""},0,"",""]
["",null,null,null,null,null,null,null,null,null,null,"","","","","",{"$f":"IFERROR(IF($F174>0,IF($B$6=\"Canada\",IF($E174=\"CAD\",$F174*((Settings!$B$2)+1),$F174*$E$9*((Settings!$B$2)+1)), IF($E174=\"USD\",$F174*((Settings!$B$2)+1),$F174*$E$9*((Settings!$B$2)+1))),””),\"\")","v":""},{"$f":"IFERROR(IF($F174>0,$AA174*(1-Settings!$B$3),\"\"),\"\")","v":""},"",null,null,null,null,"","","",0,"",0,0,{"$f":"IF($C174<>\"\",GetStockNumParam($C174,\"h\"),\"\")","v":""},0,"",""]
["",null,null,null,null,null,null,null,null,null,null,"","","","","",{"$f":"IFERROR(IF($F175>0,IF($B$6=\"Canada\",IF($E175=\"CAD\",$F175*((Settings!$B$2)+1),$F175*$E$9*((Settings!$B$2)+1)), IF($E175=\"USD\",$F175*((Settings!$B$2)+1),$F175*$E$9*((Settings!$B$2)+1))),””),\"\")","v":""},{"$f":"IFERROR(IF($F175>0,$AA175*(1-Settings!$B$3),\"\"),\"\")","v":""},"",null,null,null,null,"","","",0,"",0,0,{"$f":"IF($C175<>\"\",GetStockNumParam($C175,\"h\"),\"\")","v":""},0,"",""]
["",null,null,null,null,null,null,null,null,null,null,"","","","","",{"$f":"IFERROR(IF($F176>0,IF($B$6=\"Canada\",IF($E176=\"CAD\",$F176*((Settings!$B$2)+1),$F176*$E$9*((Settings!$B$2)+1)), IF($E176=\"USD\",$F176*((Settings!$B$2)+1),$F176*$E$9*((Settings!$B$2)+1))),””),\"\")","v":""},{"$f":"IFERROR(IF($F176>0,$AA176*(1-Settings!$B$3),\"\"),\"\")","v":""},"",null,null,null,null,"","","",0,"",0,0,{"$f":"IF($C176<>\"\",GetStockNumParam($C176,\"h\"),\"\")","v":""},0,"",""]
["",null,null,null,null,null,null,null,null,null,null,"","","","","",{"$f":"IFERROR(IF($F177>0,IF($B$6=\"Canada\",IF($E177=\"CAD\",$F177*((Settings!$B$2)+1),$F177*$E$9*((Settings!$B$2)+1)), IF($E177=\"USD\",$F177*((Settings!$B$2)+1),$F177*$E$9*((Settings!$B$2)+1))),””),\"\")","v":""},{"$f":"IFERROR(IF($F177>0,$AA177*(1-Settings!$B$3),\"\"),\"\")","v":""},"",null,null,null,null,"","","",0,"",0,0,{"$f":"IF($C177<>\"\",GetStockNumParam($C177,\"h\"),\"\")","v":""},0,"",""]
["",null,null,null,null,null,null,null,null,null,null,"","","","","",{"$f":"IFERROR(IF($F178>0,IF($B$6=\"Canada\",IF($E178=\"CAD\",$F178*((Settings!$B$2)+1),$F178*$E$9*((Settings!$B$2)+1)), IF($E178=\"USD\",$F178*((Settings!$B$2)+1),$F178*$E$9*((Settings!$B$2)+1))),””),\"\")","v":""},{"$f":"IFERROR(IF($F178>0,$AA178*(1-Settings!$B$3),\"\"),\"\")","v":""},"",null,null,null,null,"","","",0,"",0,0,{"$f":"IF($C178<>\"\",GetStockNumParam($C178,\"h\"),\"\")","v":""},0,"",""]
["",null,null,null,null,null,null,null,null,null,null,"","","","","",{"$f":"IFERROR(IF($F179>0,IF($B$6=\"Canada\",IF($E179=\"CAD\",$F179*((Settings!$B$2)+1),$F179*$E$9*((Settings!$B$2)+1)), IF($E179=\"USD\",$F179*((Settings!$B$2)+1),$F179*$E$9*((Settings!$B$2)+1))),””),\"\")","v":""},{"$f":"IFERROR(IF($F179>0,$AA179*(1-Settings!$B$3),\"\"),\"\")","v":""},"",null,null,null,null,"","","",0,"",0,0,{"$f":"IF($C179<>\"\",GetStockNumParam($C179,\"h\"),\"\")","v":""},0,"",""]
["",null,null,null,null,null,null,null,null,null,null,"","","","","",{"$f":"IFERROR(IF($F180>0,IF($B$6=\"Canada\",IF($E180=\"CAD\",$F180*((Settings!$B$2)+1),$F180*$E$9*((Settings!$B$2)+1)), IF($E180=\"USD\",$F180*((Settings!$B$2)+1),$F180*$E$9*((Settings!$B$2)+1))),””),\"\")","v":""},{"$f":"IFERROR(IF($F180>0,$AA180*(1-Settings!$B$3),\"\"),\"\")","v":""},"",null,null,null,null,"","","",0,"",0,0,{"$f":"IF($C180<>\"\",GetStockNumParam($C180,\"h\"),\"\")","v":""},0,"",""]
["",null,null,null,null,null,null,null,null,null,null,"","","","","",{"$f":"IFERROR(IF($F181>0,IF($B$6=\"Canada\",IF($E181=\"CAD\",$F181*((Settings!$B$2)+1),$F181*$E$9*((Settings!$B$2)+1)), IF($E181=\"USD\",$F181*((Settings!$B$2)+1),$F181*$E$9*((Settings!$B$2)+1))),””),\"\")","v":""},{"$f":"IFERROR(IF($F181>0,$AA181*(1-Settings!$B$3),\"\"),\"\")","v":""},"",null,null,null,null,"","","",0,"",0,0,{"$f":"IF($C181<>\"\",GetStockNumParam($C181,\"h\"),\"\")","v":""},0,"",""]
["",null,null,null,null,null,null,null,null,null,null,"","","","","",{"$f":"IFERROR(IF($F182>0,IF($B$6=\"Canada\",IF($E182=\"CAD\",$F182*((Settings!$B$2)+1),$F182*$E$9*((Settings!$B$2)+1)), IF($E182=\"USD\",$F182*((Settings!$B$2)+1),$F182*$E$9*((Settings!$B$2)+1))),””),\"\")","v":""},{"$f":"IFERROR(IF($F182>0,$AA182*(1-Settings!$B$3),\"\"),\"\")","v":""},"",null,null,null,null,"","","",0,"",0,0,{"$f":"IF($C182<>\"\",GetStockNumParam($C182,\"h\"),\"\")","v":""},0,"",""]
["",null,null,null,null,null,null,null,null,null,null,"","","","","",{"$f":"IFERROR(IF($F183>0,IF($B$6=\"Canada\",IF($E183=\"CAD\",$F183*((Settings!$B$2)+1),$F183*$E$9*((Settings!$B$2)+1)), IF($E183=\"USD\",$F183*((Settings!$B$2)+1),$F183*$E$9*((Settings!$B$2)+1))),””),\"\")","v":""},{"$f":"IFERROR(IF($F183>0,$AA183*(1-Settings!$B$3),\"\"),\"\")","v":""},"",null,null,null,null,"","","",0,"",0,0,{"$f":"IF($C183<>\"\",GetStockNumParam($C183,\"h\"),\"\")","v":""},0,"",""]
["",null,null,null,null,null,null,null,null,null,null,"","","","","",{"$f":"IFERROR(IF($F184>0,IF($B$6=\"Canada\",IF($E184=\"CAD\",$F184*((Settings!$B$2)+1),$F184*$E$9*((Settings!$B$2)+1)), IF($E184=\"USD\",$F184*((Settings!$B$2)+1),$F184*$E$9*((Settings!$B$2)+1))),””),\"\")","v":""},{"$f":"IFERROR(IF($F184>0,$AA184*(1-Settings!$B$3),\"\"),\"\")","v":""},"",null,null,null,null,"","","",0,"",0,0,{"$f":"IF($C184<>\"\",GetStockNumParam($C184,\"h\"),\"\")","v":""},0,"",""]
["",null,null,null,null,null,null,null,null,null,null,"","","","","",{"$f":"IFERROR(IF($F185>0,IF($B$6=\"Canada\",IF($E185=\"CAD\",$F185*((Settings!$B$2)+1),$F185*$E$9*((Settings!$B$2)+1)), IF($E185=\"USD\",$F185*((Settings!$B$2)+1),$F185*$E$9*((Settings!$B$2)+1))),””),\"\")","v":""},{"$f":"IFERROR(IF($F185>0,$AA185*(1-Settings!$B$3),\"\"),\"\")","v":""},"",null,null,null,null,"","","",0,"",0,0,{"$f":"IF($C185<>\"\",GetStockNumParam($C185,\"h\"),\"\")","v":""},0,"",""]
["",null,null,null,null,null,null,null,null,null,null,"","","","","",{"$f":"IFERROR(IF($F186>0,IF($B$6=\"Canada\",IF($E186=\"CAD\",$F186*((Settings!$B$2)+1),$F186*$E$9*((Settings!$B$2)+1)), IF($E186=\"USD\",$F186*((Settings!$B$2)+1),$F186*$E$9*((Settings!$B$2)+1))),””),\"\")","v":""},{"$f":"IFERROR(IF($F186>0,$AA186*(1-Settings!$B$3),\"\"),\"\")","v":""},"",null,null,null,null,"","","",0,"",0,0,{"$f":"IF($C186<>\"\",GetStockNumParam($C186,\"h\"),\"\")","v":""},0,"",""]
["",null,null,null,null,null,null,null,null,null,null,"","","","","",{"$f":"IFERROR(IF($F187>0,IF($B$6=\"Canada\",IF($E187=\"CAD\",$F187*((Settings!$B$2)+1),$F187*$E$9*((Settings!$B$2)+1)), IF($E187=\"USD\",$F187*((Settings!$B$2)+1),$F187*$E$9*((Settings!$B$2)+1))),””),\"\")","v":""},{"$f":"IFERROR(IF($F187>0,$AA187*(1-Settings!$B$3),\"\"),\"\")","v":""},"",null,null,null,null,"","","",0,"",0,0,{"$f":"IF($C187<>\"\",GetStockNumParam($C187,\"h\"),\"\")","v":""},0,"",""]
["",null,null,null,null,null,null,null,null,null,null,"","","","","",{"$f":"IFERROR(IF($F188>0,IF($B$6=\"Canada\",IF($E188=\"CAD\",$F188*((Settings!$B$2)+1),$F188*$E$9*((Settings!$B$2)+1)), IF($E188=\"USD\",$F188*((Settings!$B$2)+1),$F188*$E$9*((Settings!$B$2)+1))),””),\"\")","v":""},{"$f":"IFERROR(IF($F188>0,$AA188*(1-Settings!$B$3),\"\"),\"\")","v":""},"",null,null,null,null,"","","",0,"",0,0,{"$f":"IF($C188<>\"\",GetStockNumParam($C188,\"h\"),\"\")","v":""},0,"",""]
["",null,null,null,null,null,null,null,null,null,null,"","","","","",{"$f":"IFERROR(IF($F189>0,IF($B$6=\"Canada\",IF($E189=\"CAD\",$F189*((Settings!$B$2)+1),$F189*$E$9*((Settings!$B$2)+1)), IF($E189=\"USD\",$F189*((Settings!$B$2)+1),$F189*$E$9*((Settings!$B$2)+1))),””),\"\")","v":""},{"$f":"IFERROR(IF($F189>0,$AA189*(1-Settings!$B$3),\"\"),\"\")","v":""},"",null,null,null,null,"","","",0,"",0,0,{"$f":"IF($C189<>\"\",GetStockNumParam($C189,\"h\"),\"\")","v":""},0,"",""]
["",null,null,null,null,null,null,null,null,null,null,"","","","","",{"$f":"IFERROR(IF($F190>0,IF($B$6=\"Canada\",IF($E190=\"CAD\",$F190*((Settings!$B$2)+1),$F190*$E$9*((Settings!$B$2)+1)), IF($E190=\"USD\",$F190*((Settings!$B$2)+1),$F190*$E$9*((Settings!$B$2)+1))),””),\"\")","v":""},{"$f":"IFERROR(IF($F190>0,$AA190*(1-Settings!$B$3),\"\"),\"\")","v":""},"",null,null,null,null,"","","",0,"",0,0,{"$f":"IF($C190<>\"\",GetStockNumParam($C190,\"h\"),\"\")","v":""},0,"",""]
["",null,null,null,null,null,null,null,null,null,null,"","","","","",{"$f":"IFERROR(IF($F191>0,IF($B$6=\"Canada\",IF($E191=\"CAD\",$F191*((Settings!$B$2)+1),$F191*$E$9*((Settings!$B$2)+1)), IF($E191=\"USD\",$F191*((Settings!$B$2)+1),$F191*$E$9*((Settings!$B$2)+1))),””),\"\")","v":""},{"$f":"IFERROR(IF($F191>0,$AA191*(1-Settings!$B$3),\"\"),\"\")","v":""},"",null,null,null,null,"","","",0,"",0,0,{"$f":"IF($C191<>\"\",GetStockNumParam($C191,\"h\"),\"\")","v":""},0,"",""]
["",null,null,null,null,null,null,null,null,null,null,"","","","","",{"$f":"IFERROR(IF($F192>0,IF($B$6=\"Canada\",IF($E192=\"CAD\",$F192*((Settings!$B$2)+1),$F192*$E$9*((Settings!$B$2)+1)), IF($E192=\"USD\",$F192*((Settings!$B$2)+1),$F192*$E$9*((Settings!$B$2)+1))),””),\"\")","v":""},{"$f":"IFERROR(IF($F192>0,$AA192*(1-Settings!$B$3),\"\"),\"\")","v":""},"",null,null,null,null,"","","",0,"",0,0,{"$f":"IF($C192<>\"\",GetStockNumParam($C192,\"h\"),\"\")","v":""},0,"",""]
["",null,null,null,null,null,null,null,null,null,null,"","","","","",{"$f":"IFERROR(IF($F193>0,IF($B$6=\"Canada\",IF($E193=\"CAD\",$F193*((Settings!$B$2)+1),$F193*$E$9*((Settings!$B$2)+1)), IF($E193=\"USD\",$F193*((Settings!$B$2)+1),$F193*$E$9*((Settings!$B$2)+1))),””),\"\")","v":""},{"$f":"IFERROR(IF($F193>0,$AA193*(1-Settings!$B$3),\"\"),\"\")","v":""},"",null,null,null,null,"","","",0,"",0,0,{"$f":"IF($C193<>\"\",GetStockNumParam($C193,\"h\"),\"\")","v":""},0,"",""]
["",null,null,null,null,null,null,null,null,null,null,"","","","","",{"$f":"IFERROR(IF($F194>0,IF($B$6=\"Canada\",IF($E194=\"CAD\",$F194*((Settings!$B$2)+1),$F194*$E$9*((Settings!$B$2)+1)), IF($E194=\"USD\",$F194*((Settings!$B$2)+1),$F194*$E$9*((Settings!$B$2)+1))),””),\"\")","v":""},{"$f":"IFERROR(IF($F194>0,$AA194*(1-Settings!$B$3),\"\"),\"\")","v":""},"",null,null,null,null,"","","",0,"",0,0,{"$f":"IF($C194<>\"\",GetStockNumParam($C194,\"h\"),\"\")","v":""},0,"",""]
["",null,null,null,null,null,null,null,null,null,null,"","","","","",{"$f":"IFERROR(IF($F195>0,IF($B$6=\"Canada\",IF($E195=\"CAD\",$F195*((Settings!$B$2)+1),$F195*$E$9*((Settings!$B$2)+1)), IF($E195=\"USD\",$F195*((Settings!$B$2)+1),$F195*$E$9*((Settings!$B$2)+1))),””),\"\")","v":""},{"$f":"IFERROR(IF($F195>0,$AA195*(1-Settings!$B$3),\"\"),\"\")","v":""},"",null,null,null,null,"","","",0,"",0,0,{"$f":"IF($C195<>\"\",GetStockNumParam($C195,\"h\"),\"\")","v":""},0,"",""]
["",null,null,null,null,null,null,null,null,null,null,"","","","","",{"$f":"IFERROR(IF($F196>0,IF($B$6=\"Canada\",IF($E196=\"CAD\",$F196*((Settings!$B$2)+1),$F196*$E$9*((Settings!$B$2)+1)), IF($E196=\"USD\",$F196*((Settings!$B$2)+1),$F196*$E$9*((Settings!$B$2)+1))),””),\"\")","v":""},{"$f":"IFERROR(IF($F196>0,$AA196*(1-Settings!$B$3),\"\"),\"\")","v":""},"",null,null,null,null,"","","",0,"",0,0,{"$f":"IF($C196<>\"\",GetStockNumParam($C196,\"h\"),\"\")","v":""},0,"",""]
["",null,null,null,null,null,null,null,null,null,null,"","","","","",{"$f":"IFERROR(IF($F197>0,IF($B$6=\"Canada\",IF($E197=\"CAD\",$F197*((Settings!$B$2)+1),$F197*$E$9*((Settings!$B$2)+1)), IF($E197=\"USD\",$F197*((Settings!$B$2)+1),$F197*$E$9*((Settings!$B$2)+1))),””),\"\")","v":""},{"$f":"IFERROR(IF($F197>0,$AA197*(1-Settings!$B$3),\"\"),\"\")","v":""},"",null,null,null,null,"","","",0,"",0,0,{"$f":"IF($C197<>\"\",GetStockNumParam($C197,\"h\"),\"\")","v":""},0,"",""]
["",null,null,null,null,null,null,null,null,null,null,"","","","","",{"$f":"IFERROR(IF($F198>0,IF($B$6=\"Canada\",IF($E198=\"CAD\",$F198*((Settings!$B$2)+1),$F198*$E$9*((Settings!$B$2)+1)), IF($E198=\"USD\",$F198*((Settings!$B$2)+1),$F198*$E$9*((Settings!$B$2)+1))),””),\"\")","v":""},{"$f":"IFERROR(IF($F198>0,$AA198*(1-Settings!$B$3),\"\"),\"\")","v":""},"",null,null,null,null,"","","",0,"",0,0,{"$f":"IF($C198<>\"\",GetStockNumParam($C198,\"h\"),\"\")","v":""},0,"",""]
["",null,null,null,null,null,null,null,null,null,null,"","","","","",{"$f":"IFERROR(IF($F199>0,IF($B$6=\"Canada\",IF($E199=\"CAD\",$F199*((Settings!$B$2)+1),$F199*$E$9*((Settings!$B$2)+1)), IF($E199=\"USD\",$F199*((Settings!$B$2)+1),$F199*$E$9*((Settings!$B$2)+1))),””),\"\")","v":""},{"$f":"IFERROR(IF($F199>0,$AA199*(1-Settings!$B$3),\"\"),\"\")","v":""},"",null,null,null,null,"","","",0,"",0,0,{"$f":"IF($C199<>\"\",GetStockNumParam($C199,\"h\"),\"\")","v":""},0,"",""]
["",null,null,null,null,null,null,null,null,null,null,"","","","","",{"$f":"IFERROR(IF($F200>0,IF($B$6=\"Canada\",IF($E200=\"CAD\",$F200*((Settings!$B$2)+1),$F200*$E$9*((Settings!$B$2)+1)), IF($E200=\"USD\",$F200*((Settings!$B$2)+1),$F200*$E$9*((Settings!$B$2)+1))),””),\"\")","v":""},{"$f":"IFERROR(IF($F200>0,$AA200*(1-Settings!$B$3),\"\"),\"\")","v":""},"",null,null,null,null,"","","",0,"",0,0,{"$f":"IF($C200<>\"\",GetStockNumParam($C200,\"h\"),\"\")","v":""},0,"",""]
["",null,null,null,null,null,null,null,null,null,null,"","","","","",{"$f":"IFERROR(IF($F201>0,IF($B$6=\"Canada\",IF($E201=\"CAD\",$F201*((Settings!$B$2)+1),$F201*$E$9*((Settings!$B$2)+1)), IF($E201=\"USD\",$F201*((Settings!$B$2)+1),$F201*$E$9*((Settings!$B$2)+1))),””),\"\")","v":""},{"$f":"IFERROR(IF($F201>0,$AA201*(1-Settings!$B$3),\"\"),\"\")","v":""},"",null,null,null,null,"","","",0,"",0,0,{"$f":"IF($C201<>\"\",GetStockNumParam($C201,\"h\"),\"\")","v":""},0,"",""]
["",null,null,null,null,null,null,null,null,null,null,"","","","","",{"$f":"IFERROR(IF($F202>0,IF($B$6=\"Canada\",IF($E202=\"CAD\",$F202*((Settings!$B$2)+1),$F202*$E$9*((Settings!$B$2)+1)), IF($E202=\"USD\",$F202*((Settings!$B$2)+1),$F202*$E$9*((Settings!$B$2)+1))),””),\"\")","v":""},{"$f":"IFERROR(IF($F202>0,$AA202*(1-Settings!$B$3),\"\"),\"\")","v":""},"",null,null,null,null,"","","",0,"",0,0,{"$f":"IF($C202<>\"\",GetStockNumParam($C202,\"h\"),\"\")","v":""},0,"",""]
["",null,null,null,null,null,null,null,null,null,null,{"$f":"IF(J203 > 0,K203-J203,\"\")","v":""},"",{"$f":"IF(D203 > 0,IF(T203 > 0,\"SOLD\",D203*K203),\"\")","v":""},{"$f":"IF(D203 > 0,IF(T203 > 0, Z203-I203, N203-I203),\"\")","v":""},{"$f":"IF(D203 > 0,IF(O203=0,0,(O203/I203)),\"\")","v":""},{"$f":"IFERROR(IF($F203>0,IF($B$6=\"Canada\",IF($E203=\"CAD\",$F203*((Settings!$B$2)+1),$F203*$E$9*((Settings!$B$2)+1)), IF($E203=\"USD\",$F203*((Settings!$B$2)+1),$F203*$E$9*((Settings!$B$2)+1))),””),\"\")","v":""},{"$f":"IFERROR(IF($F203>0,$AA203*(1-Settings!$B$3),\"\"),\"\")","v":""},{"$f":"IF(F203>0,IF(K203>=Q203,\"SELL\",IF(K203<=R203,\"STOP\",\"HOLD\")),\"\")","v":""},null,null,null,null,{"$f":"IF(D203 > 0,IF(Z203 = 0,0,Z203-I203),\"\")","v":""},{"$f":"IF(D203 > 0,IF(Z203=0,0,(Z203/I203)-100%),\"\")","v":""},{"$f":"IF(T203 > 0,T203*D203-V203+W203,N203)","v":""},0,"",0,{"$f":"IF(N203 = \"SOLD\", Z203-I203,I203)","v":0},{"$f":"IF($C203<>\"\",GetStockNumParam($C203,\"h\"),\"\")","v":""},0,"",""]
[{"$f":"IF($C204=\"\",\"\",GetName($C204))","v":""},null,null,null,null,null,null,null,null,null,null,"",{"$f":"IF(J204 > 0,(L204/J204),\"\")","v":""},"","","",{"$f":"IFERROR(IF($F204>0,IF($B$6=\"Canada\",IF($E204=\"CAD\",$F204*((Settings!$B$2)+1),$F204*$E$9*((Settings!$B$2)+1)), IF($E204=\"USD\",$F204*((Settings!$B$2)+1),$F204*$E$9*((Settings!$B$2)+1))),””),\"\")","v":""},{"$f":"IFERROR(IF($F204>0,$AA204*(1-Settings!$B$3),\"\"),\"\")","v":""},"",null,null,null,null,"","","",{"$f":"IF($B$6=\"Canada\",\nIF($E204=\"CAD\",IF($F204>$K204,$F204,$K204),IF(($F204*$E$9)>$K204,($F204*$E$9),$K204)),\nIF($E204=\"CAD\",IF(($F204*$E$9)>$K204,($F204*$E$9),$K204),IF($F204>$K204,$F204,$K204)))","v":0},{"$f":"IF($B204=\"Simulate\",0,IF(N204 = \"SOLD\", 0, N204))","v":""},{"$f":"IF($B204=\"Simulate\",0,IF(N204 = \"SOLD\",0,I204))","v":0},0,{"$f":"IF($C204<>\"\",GetStockNumParam($C204,\"h\"),\"\")","v":""},{"$f":"IF($B204=\"Simulate\",0,$I204)","v":0},{"$f":"IF($B204=\"Simulate\",0,Z204)","v":""},{"$f":"IF($B204=\"Simulate\",\"\",$O204)","v":""}]
["",null,null,null,null,null,null,null,null,null,null,"","","","","",{"$f":"IFERROR(IF($F205>0,IF($B$6=\"Canada\",IF($E205=\"CAD\",$F205*((Settings!$B$2)+1),$F205*$E$9*((Settings!$B$2)+1)), IF($E205=\"USD\",$F205*((Settings!$B$2)+1),$F205*$E$9*((Settings!$B$2)+1))),””),\"\")","v":""},{"$f":"IFERROR(IF($F205>0,$AA205*(1-Settings!$B$3),\"\"),\"\")","v":""},"",null,null,null,null,"","","",0,"",0,0,{"$f":"IF($C205<>\"\",GetStockNumParam($C205,\"h\"),\"\")","v":""},0,"",""]
["",null,null,null,null,null,null,null,null,null,null,"","","","","",{"$f":"IFERROR(IF($F206>0,IF($B$6=\"Canada\",IF($E206=\"CAD\",$F206*((Settings!$B$2)+1),$F206*$E$9*((Settings!$B$2)+1)), IF($E206=\"USD\",$F206*((Settings!$B$2)+1),$F206*$E$9*((Settings!$B$2)+1))),””),\"\")","v":""},{"$f":"IFERROR(IF($F206>0,$AA206*(1-Settings!$B$3),\"\"),\"\")","v":""},"",null,null,null,null,"","","",0,"",0,0,{"$f":"IF($C206<>\"\",GetStockNumParam($C206,\"h\"),\"\")","v":""},0,"",""]
["",null,null,null,null,null,null,null,null,null,null,"","","","","",{"$f":"IFERROR(IF($F207>0,IF($B$6=\"Canada\",IF($E207=\"CAD\",$F207*((Settings!$B$2)+1),$F207*$E$9*((Settings!$B$2)+1)), IF($E207=\"USD\",$F207*((Settings!$B$2)+1),$F207*$E$9*((Settings!$B$2)+1))),””),\"\")","v":""},{"$f":"IFERROR(IF($F207>0,$AA207*(1-Settings!$B$3),\"\"),\"\")","v":""},"",null,null,null,null,"","","",0,"",0,0,{"$f":"IF($C207<>\"\",GetStockNumParam($C207,\"h\"),\"\")","v":""},0,"",""]
["",null,null,null,null,null,null,null,null,null,null,"","","","","",{"$f":"IFERROR(IF($F208>0,IF($B$6=\"Canada\",IF($E208=\"CAD\",$F208*((Settings!$B$2)+1),$F208*$E$9*((Settings!$B$2)+1)), IF($E208=\"USD\",$F208*((Settings!$B$2)+1),$F208*$E$9*((Settings!$B$2)+1))),””),\"\")","v":""},{"$f":"IFERROR(IF($F208>0,$AA208*(1-Settings!$B$3),\"\"),\"\")","v":""},"",null,null,null,null,"","","",0,"",0,0,{"$f":"IF($C208<>\"\",GetStockNumParam($C208,\"h\"),\"\")","v":""},0,"",""]
["",null,null,null,null,null,null,null,null,null,null,"","","","","",{"$f":"IFERROR(IF($F209>0,IF($B$6=\"Canada\",IF($E209=\"CAD\",$F209*((Settings!$B$2)+1),$F209*$E$9*((Settings!$B$2)+1)), IF($E209=\"USD\",$F209*((Settings!$B$2)+1),$F209*$E$9*((Settings!$B$2)+1))),””),\"\")","v":""},{"$f":"IFERROR(IF($F209>0,$AA209*(1-Settings!$B$3),\"\"),\"\")","v":""},"",null,null,null,null,"","","",0,"",0,0,{"$f":"IF($C209<>\"\",GetStockNumParam($C209,\"h\"),\"\")","v":""},0,"",""]
["",null,null,null,null,null,null,null,null,null,null,"","","","","",{"$f":"IFERROR(IF($F210>0,IF($B$6=\"Canada\",IF($E210=\"CAD\",$F210*((Settings!$B$2)+1),$F210*$E$9*((Settings!$B$2)+1)), IF($E210=\"USD\",$F210*((Settings!$B$2)+1),$F210*$E$9*((Settings!$B$2)+1))),””),\"\")","v":""},{"$f":"IFERROR(IF($F210>0,$AA210*(1-Settings!$B$3),\"\"),\"\")","v":""},"",null,null,null,null,"","","",0,"",0,0,{"$f":"IF($C210<>\"\",GetStockNumParam($C210,\"h\"),\"\")","v":""},0,"",""]
["",null,null,null,null,null,null,null,null,null,null,"","","","","",{"$f":"IFERROR(IF($F211>0,IF($B$6=\"Canada\",IF($E211=\"CAD\",$F211*((Settings!$B$2)+1),$F211*$E$9*((Settings!$B$2)+1)), IF($E211=\"USD\",$F211*((Settings!$B$2)+1),$F211*$E$9*((Settings!$B$2)+1))),””),\"\")","v":""},{"$f":"IFERROR(IF($F211>0,$AA211*(1-Settings!$B$3),\"\"),\"\")","v":""},"",null,null,null,null,"","","",0,"",0,0,{"$f":"IF($C211<>\"\",GetStockNumParam($C211,\"h\"),\"\")","v":""},0,"",""]
["",null,null,null,null,null,null,null,null,null,null,"","","","","",{"$f":"IFERROR(IF($F212>0,IF($B$6=\"Canada\",IF($E212=\"CAD\",$F212*((Settings!$B$2)+1),$F212*$E$9*((Settings!$B$2)+1)), IF($E212=\"USD\",$F212*((Settings!$B$2)+1),$F212*$E$9*((Settings!$B$2)+1))),””),\"\")","v":""},{"$f":"IFERROR(IF($F212>0,$AA212*(1-Settings!$B$3),\"\"),\"\")","v":""},"",null,null,null,null,"","","",0,"",0,0,{"$f":"IF($C212<>\"\",GetStockNumParam($C212,\"h\"),\"\")","v":""},0,"",""]
["",null,null,null,null,null,null,null,null,null,null,"","","","","",{"$f":"IFERROR(IF($F213>0,IF($B$6=\"Canada\",IF($E213=\"CAD\",$F213*((Settings!$B$2)+1),$F213*$E$9*((Settings!$B$2)+1)), IF($E213=\"USD\",$F213*((Settings!$B$2)+1),$F213*$E$9*((Settings!$B$2)+1))),””),\"\")","v":""},{"$f":"IFERROR(IF($F213>0,$AA213*(1-Settings!$B$3),\"\"),\"\")","v":""},"",null,null,null,null,"","","",0,"",0,0,{"$f":"IF($C213<>\"\",GetStockNumParam($C213,\"h\"),\"\")","v":""},0,"",""]
["",null,null,null,null,null,null,null,null,null,null,"","","","","",{"$f":"IFERROR(IF($F214>0,IF($B$6=\"Canada\",IF($E214=\"CAD\",$F214*((Settings!$B$2)+1),$F214*$E$9*((Settings!$B$2)+1)), IF($E214=\"USD\",$F214*((Settings!$B$2)+1),$F214*$E$9*((Settings!$B$2)+1))),””),\"\")","v":""},{"$f":"IFERROR(IF($F214>0,$AA214*(1-Settings!$B$3),\"\"),\"\")","v":""},"",null,null,null,null,"","","",0,"",0,0,{"$f":"IF($C214<>\"\",GetStockNumParam($C214,\"h\"),\"\")","v":""},0,"",""]
["",null,null,null,null,null,null,null,null,null,null,"","","","","",{"$f":"IFERROR(IF($F215>0,IF($B$6=\"Canada\",IF($E215=\"CAD\",$F215*((Settings!$B$2)+1),$F215*$E$9*((Settings!$B$2)+1)), IF($E215=\"USD\",$F215*((Settings!$B$2)+1),$F215*$E$9*((Settings!$B$2)+1))),””),\"\")","v":""},{"$f":"IFERROR(IF($F215>0,$AA215*(1-Settings!$B$3),\"\"),\"\")","v":""},"",null,null,null,null,"","","",0,"",0,0,{"$f":"IF($C215<>\"\",GetStockNumParam($C215,\"h\"),\"\")","v":""},0,"",""]
["",null,null,null,null,null,null,null,null,null,null,"","","","","",{"$f":"IFERROR(IF($F216>0,IF($B$6=\"Canada\",IF($E216=\"CAD\",$F216*((Settings!$B$2)+1),$F216*$E$9*((Settings!$B$2)+1)), IF($E216=\"USD\",$F216*((Settings!$B$2)+1),$F216*$E$9*((Settings!$B$2)+1))),””),\"\")","v":""},{"$f":"IFERROR(IF($F216>0,$AA216*(1-Settings!$B$3),\"\"),\"\")","v":""},"",null,null,null,null,"","","",0,"",0,0,{"$f":"IF($C216<>\"\",GetStockNumParam($C216,\"h\"),\"\")","v":""},0,"",""]
["",null,null,null,null,null,null,null,null,null,null,"","","","","",{"$f":"IFERROR(IF($F217>0,IF($B$6=\"Canada\",IF($E217=\"CAD\",$F217*((Settings!$B$2)+1),$F217*$E$9*((Settings!$B$2)+1)), IF($E217=\"USD\",$F217*((Settings!$B$2)+1),$F217*$E$9*((Settings!$B$2)+1))),””),\"\")","v":""},{"$f":"IFERROR(IF($F217>0,$AA217*(1-Settings!$B$3),\"\"),\"\")","v":""},"",null,null,null,null,"","","",0,"",0,0,{"$f":"IF($C217<>\"\",GetStockNumParam($C217,\"h\"),\"\")","v":""},0,"",""]
["",null,null,null,null,null,null,null,null,null,null,"","","","","",{"$f":"IFERROR(IF($F218>0,IF($B$6=\"Canada\",IF($E218=\"CAD\",$F218*((Settings!$B$2)+1),$F218*$E$9*((Settings!$B$2)+1)), IF($E218=\"USD\",$F218*((Settings!$B$2)+1),$F218*$E$9*((Settings!$B$2)+1))),””),\"\")","v":""},{"$f":"IFERROR(IF($F218>0,$AA218*(1-Settings!$B$3),\"\"),\"\")","v":""},"",null,null,null,null,"","","",0,"",0,0,{"$f":"IF($C218<>\"\",GetStockNumParam($C218,\"h\"),\"\")","v":""},0,"",""]
["",null,null,null,null,null,null,null,null,null,null,"","","","","",{"$f":"IFERROR(IF($F219>0,IF($B$6=\"Canada\",IF($E219=\"CAD\",$F219*((Settings!$B$2)+1),$F219*$E$9*((Settings!$B$2)+1)), IF($E219=\"USD\",$F219*((Settings!$B$2)+1),$F219*$E$9*((Settings!$B$2)+1))),””),\"\")","v":""},{"$f":"IFERROR(IF($F219>0,$AA219*(1-Settings!$B$3),\"\"),\"\")","v":""},"",null,null,null,null,"","","",0,"",0,0,{"$f":"IF($C219<>\"\",GetStockNumParam($C219,\"h\"),\"\")","v":""},0,"",""]
["",null,null,null,null,null,null,null,null,null,null,"","","","","",{"$f":"IFERROR(IF($F220>0,IF($B$6=\"Canada\",IF($E220=\"CAD\",$F220*((Settings!$B$2)+1),$F220*$E$9*((Settings!$B$2)+1)), IF($E220=\"USD\",$F220*((Settings!$B$2)+1),$F220*$E$9*((Settings!$B$2)+1))),””),\"\")","v":""},{"$f":"IFERROR(IF($F220>0,$AA220*(1-Settings!$B$3),\"\"),\"\")","v":""},"",null,null,null,null,"","","",0,"",0,0,{"$f":"IF($C220<>\"\",GetStockNumParam($C220,\"h\"),\"\")","v":""},0,"",""]
["",null,null,null,null,null,null,null,null,null,null,"","","","","",{"$f":"IFERROR(IF($F221>0,IF($B$6=\"Canada\",IF($E221=\"CAD\",$F221*((Settings!$B$2)+1),$F221*$E$9*((Settings!$B$2)+1)), IF($E221=\"USD\",$F221*((Settings!$B$2)+1),$F221*$E$9*((Settings!$B$2)+1))),””),\"\")","v":""},{"$f":"IFERROR(IF($F221>0,$AA221*(1-Settings!$B$3),\"\"),\"\")","v":""},"",null,null,null,null,"","","",0,"",0,0,{"$f":"IF($C221<>\"\",GetStockNumParam($C221,\"h\"),\"\")","v":""},0,"",""]
["",null,null,null,null,null,null,null,null,null,null,"","","","","",{"$f":"IFERROR(IF($F222>0,IF($B$6=\"Canada\",IF($E222=\"CAD\",$F222*((Settings!$B$2)+1),$F222*$E$9*((Settings!$B$2)+1)), IF($E222=\"USD\",$F222*((Settings!$B$2)+1),$F222*$E$9*((Settings!$B$2)+1))),””),\"\")","v":""},{"$f":"IFERROR(IF($F222>0,$AA222*(1-Settings!$B$3),\"\"),\"\")","v":""},"",null,null,null,null,"","","",0,"",0,0,{"$f":"IF($C222<>\"\",GetStockNumParam($C222,\"h\"),\"\")","v":""},0,"",""]
["",null,null,null,null,null,null,null,null,null,null,"","","","","",{"$f":"IFERROR(IF($F223>0,IF($B$6=\"Canada\",IF($E223=\"CAD\",$F223*((Settings!$B$2)+1),$F223*$E$9*((Settings!$B$2)+1)), IF($E223=\"USD\",$F223*((Settings!$B$2)+1),$F223*$E$9*((Settings!$B$2)+1))),””),\"\")","v":""},{"$f":"IFERROR(IF($F223>0,$AA223*(1-Settings!$B$3),\"\"),\"\")","v":""},"",null,null,null,null,"","","",0,"",0,0,{"$f":"IF($C223<>\"\",GetStockNumParam($C223,\"h\"),\"\")","v":""},0,"",""]
["",null,null,null,null,null,null,null,null,null,null,"","","","","",{"$f":"IFERROR(IF($F224>0,IF($B$6=\"Canada\",IF($E224=\"CAD\",$F224*((Settings!$B$2)+1),$F224*$E$9*((Settings!$B$2)+1)), IF($E224=\"USD\",$F224*((Settings!$B$2)+1),$F224*$E$9*((Settings!$B$2)+1))),””),\"\")","v":""},{"$f":"IFERROR(IF($F224>0,$AA224*(1-Settings!$B$3),\"\"),\"\")","v":""},"",null,null,null,null,"","","",0,"",0,0,{"$f":"IF($C224<>\"\",GetStockNumParam($C224,\"h\"),\"\")","v":""},0,"",""]
["",null,null,null,null,null,null,null,null,null,null,"","","","","",{"$f":"IFERROR(IF($F225>0,IF($B$6=\"Canada\",IF($E225=\"CAD\",$F225*((Settings!$B$2)+1),$F225*$E$9*((Settings!$B$2)+1)), IF($E225=\"USD\",$F225*((Settings!$B$2)+1),$F225*$E$9*((Settings!$B$2)+1))),””),\"\")","v":""},{"$f":"IFERROR(IF($F225>0,$AA225*(1-Settings!$B$3),\"\"),\"\")","v":""},"",null,null,null,null,"","","",0,"",0,0,{"$f":"IF($C225<>\"\",GetStockNumParam($C225,\"h\"),\"\")","v":""},0,"",""]
["",null,null,null,null,null,null,null,null,null,null,"","","","","",{"$f":"IFERROR(IF($F226>0,IF($B$6=\"Canada\",IF($E226=\"CAD\",$F226*((Settings!$B$2)+1),$F226*$E$9*((Settings!$B$2)+1)), IF($E226=\"USD\",$F226*((Settings!$B$2)+1),$F226*$E$9*((Settings!$B$2)+1))),””),\"\")","v":""},{"$f":"IFERROR(IF($F226>0,$AA226*(1-Settings!$B$3),\"\"),\"\")","v":""},"",null,null,null,null,"","","",0,"",0,0,{"$f":"IF($C226<>\"\",GetStockNumParam($C226,\"h\"),\"\")","v":""},0,"",""]
["",null,null,null,null,null,null,null,null,null,null,"","","","","",{"$f":"IFERROR(IF($F227>0,IF($B$6=\"Canada\",IF($E227=\"CAD\",$F227*((Settings!$B$2)+1),$F227*$E$9*((Settings!$B$2)+1)), IF($E227=\"USD\",$F227*((Settings!$B$2)+1),$F227*$E$9*((Settings!$B$2)+1))),””),\"\")","v":""},{"$f":"IFERROR(IF($F227>0,$AA227*(1-Settings!$B$3),\"\"),\"\")","v":""},"",null,null,null,null,"","","",0,"",0,0,{"$f":"IF($C227<>\"\",GetStockNumParam($C227,\"h\"),\"\")","v":""},0,"",""]
["",null,null,null,null,null,null,null,null,null,null,"","","","","",{"$f":"IFERROR(IF($F228>0,IF($B$6=\"Canada\",IF($E228=\"CAD\",$F228*((Settings!$B$2)+1),$F228*$E$9*((Settings!$B$2)+1)), IF($E228=\"USD\",$F228*((Settings!$B$2)+1),$F228*$E$9*((Settings!$B$2)+1))),””),\"\")","v":""},{"$f":"IFERROR(IF($F228>0,$AA228*(1-Settings!$B$3),\"\"),\"\")","v":""},"",null,null,null,null,"","","",0,"",0,0,{"$f":"IF($C228<>\"\",GetStockNumParam($C228,\"h\"),\"\")","v":""},0,"",""]
["",null,null,null,null,null,null,null,null,null,null,"","","","","",{"$f":"IFERROR(IF($F229>0,IF($B$6=\"Canada\",IF($E229=\"CAD\",$F229*((Settings!$B$2)+1),$F229*$E$9*((Settings!$B$2)+1)), IF($E229=\"USD\",$F229*((Settings!$B$2)+1),$F229*$E$9*((Settings!$B$2)+1))),””),\"\")","v":""},{"$f":"IFERROR(IF($F229>0,$AA229*(1-Settings!$B$3),\"\"),\"\")","v":""},"",null,null,null,null,"","","",0,"",0,0,{"$f":"IF($C229<>\"\",GetStockNumParam($C229,\"h\"),\"\")","v":""},0,"",""]
["",null,null,null,null,null,null,null,null,null,null,"","","","","",{"$f":"IFERROR(IF($F230>0,IF($B$6=\"Canada\",IF($E230=\"CAD\",$F230*((Settings!$B$2)+1),$F230*$E$9*((Settings!$B$2)+1)), IF($E230=\"USD\",$F230*((Settings!$B$2)+1),$F230*$E$9*((Settings!$B$2)+1))),””),\"\")","v":""},{"$f":"IFERROR(IF($F230>0,$AA230*(1-Settings!$B$3),\"\"),\"\")","v":""},"",null,null,null,null,"","","",0,"",0,0,{"$f":"IF($C230<>\"\",GetStockNumParam($C230,\"h\"),\"\")","v":""},0,"",""]
["",null,null,null,null,null,null,null,null,null,null,"","","","","",{"$f":"IFERROR(IF($F231>0,IF($B$6=\"Canada\",IF($E231=\"CAD\",$F231*((Settings!$B$2)+1),$F231*$E$9*((Settings!$B$2)+1)), IF($E231=\"USD\",$F231*((Settings!$B$2)+1),$F231*$E$9*((Settings!$B$2)+1))),””),\"\")","v":""},{"$f":"IFERROR(IF($F231>0,$AA231*(1-Settings!$B$3),\"\"),\"\")","v":""},"",null,null,null,null,"","","",0,"",0,0,{"$f":"IF($C231<>\"\",GetStockNumParam($C231,\"h\"),\"\")","v":""},0,"",""]
["",null,null,null,null,null,null,null,null,null,null,"","","","","",{"$f":"IFERROR(IF($F232>0,IF($B$6=\"Canada\",IF($E232=\"CAD\",$F232*((Settings!$B$2)+1),$F232*$E$9*((Settings!$B$2)+1)), IF($E232=\"USD\",$F232*((Settings!$B$2)+1),$F232*$E$9*((Settings!$B$2)+1))),””),\"\")","v":""},{"$f":"IFERROR(IF($F232>0,$AA232*(1-Settings!$B$3),\"\"),\"\")","v":""},"",null,null,null,null,"","","",0,"",0,0,{"$f":"IF($C232<>\"\",GetStockNumParam($C232,\"h\"),\"\")","v":""},0,"",""]
["",null,null,null,null,null,null,null,null,null,null,"","","","","",{"$f":"IFERROR(IF($F233>0,IF($B$6=\"Canada\",IF($E233=\"CAD\",$F233*((Settings!$B$2)+1),$F233*$E$9*((Settings!$B$2)+1)), IF($E233=\"USD\",$F233*((Settings!$B$2)+1),$F233*$E$9*((Settings!$B$2)+1))),””),\"\")","v":""},{"$f":"IFERROR(IF($F233>0,$AA233*(1-Settings!$B$3),\"\"),\"\")","v":""},"",null,null,null,null,"","","",0,"",0,0,{"$f":"IF($C233<>\"\",GetStockNumParam($C233,\"h\"),\"\")","v":""},0,"",""]
["",null,null,null,null,null,null,null,null,null,null,"","","","","",{"$f":"IFERROR(IF($F234>0,IF($B$6=\"Canada\",IF($E234=\"CAD\",$F234*((Settings!$B$2)+1),$F234*$E$9*((Settings!$B$2)+1)), IF($E234=\"USD\",$F234*((Settings!$B$2)+1),$F234*$E$9*((Settings!$B$2)+1))),””),\"\")","v":""},{"$f":"IFERROR(IF($F234>0,$AA234*(1-Settings!$B$3),\"\"),\"\")","v":""},"",null,null,null,null,"","","",0,"",0,0,{"$f":"IF($C234<>\"\",GetStockNumParam($C234,\"h\"),\"\")","v":""},0,"",""]
["",null,null,null,null,null,null,null,null,null,null,"","","","","",{"$f":"IFERROR(IF($F235>0,IF($B$6=\"Canada\",IF($E235=\"CAD\",$F235*((Settings!$B$2)+1),$F235*$E$9*((Settings!$B$2)+1)), IF($E235=\"USD\",$F235*((Settings!$B$2)+1),$F235*$E$9*((Settings!$B$2)+1))),””),\"\")","v":""},{"$f":"IFERROR(IF($F235>0,$AA235*(1-Settings!$B$3),\"\"),\"\")","v":""},"",null,null,null,null,"","","",0,"",0,0,{"$f":"IF($C235<>\"\",GetStockNumParam($C235,\"h\"),\"\")","v":""},0,"",""]
["",null,null,null,null,null,null,null,null,null,null,"","","","","",{"$f":"IFERROR(IF($F236>0,IF($B$6=\"Canada\",IF($E236=\"CAD\",$F236*((Settings!$B$2)+1),$F236*$E$9*((Settings!$B$2)+1)), IF($E236=\"USD\",$F236*((Settings!$B$2)+1),$F236*$E$9*((Settings!$B$2)+1))),””),\"\")","v":""},{"$f":"IFERROR(IF($F236>0,$AA236*(1-Settings!$B$3),\"\"),\"\")","v":""},"",null,null,null,null,"","","",0,"",0,0,{"$f":"IF($C236<>\"\",GetStockNumParam($C236,\"h\"),\"\")","v":""},0,"",""]
["",null,null,null,null,null,null,null,null,null,null,"","","","","",{"$f":"IFERROR(IF($F237>0,IF($B$6=\"Canada\",IF($E237=\"CAD\",$F237*((Settings!$B$2)+1),$F237*$E$9*((Settings!$B$2)+1)), IF($E237=\"USD\",$F237*((Settings!$B$2)+1),$F237*$E$9*((Settings!$B$2)+1))),””),\"\")","v":""},{"$f":"IFERROR(IF($F237>0,$AA237*(1-Settings!$B$3),\"\"),\"\")","v":""},"",null,null,null,null,"","","",0,"",0,0,{"$f":"IF($C237<>\"\",GetStockNumParam($C237,\"h\"),\"\")","v":""},0,"",""]
["",null,null,null,null,null,null,null,null,null,null,"","","","","",{"$f":"IFERROR(IF($F238>0,IF($B$6=\"Canada\",IF($E238=\"CAD\",$F238*((Settings!$B$2)+1),$F238*$E$9*((Settings!$B$2)+1)), IF($E238=\"USD\",$F238*((Settings!$B$2)+1),$F238*$E$9*((Settings!$B$2)+1))),””),\"\")","v":""},{"$f":"IFERROR(IF($F238>0,$AA238*(1-Settings!$B$3),\"\"),\"\")","v":""},"",null,null,null,null,"","","",0,"",0,0,{"$f":"IF($C238<>\"\",GetStockNumParam($C238,\"h\"),\"\")","v":""},0,"",""]
["",null,null,null,null,null,null,null,null,null,null,"","","","","",{"$f":"IFERROR(IF($F239>0,IF($B$6=\"Canada\",IF($E239=\"CAD\",$F239*((Settings!$B$2)+1),$F239*$E$9*((Settings!$B$2)+1)), IF($E239=\"USD\",$F239*((Settings!$B$2)+1),$F239*$E$9*((Settings!$B$2)+1))),””),\"\")","v":""},{"$f":"IFERROR(IF($F239>0,$AA239*(1-Settings!$B$3),\"\"),\"\")","v":""},"",null,null,null,null,"","","",0,"",0,0,{"$f":"IF($C239<>\"\",GetStockNumParam($C239,\"h\"),\"\")","v":""},0,"",""]
["",null,null,null,null,null,null,null,null,null,null,"","","","","",{"$f":"IFERROR(IF($F240>0,IF($B$6=\"Canada\",IF($E240=\"CAD\",$F240*((Settings!$B$2)+1),$F240*$E$9*((Settings!$B$2)+1)), IF($E240=\"USD\",$F240*((Settings!$B$2)+1),$F240*$E$9*((Settings!$B$2)+1))),””),\"\")","v":""},{"$f":"IFERROR(IF($F240>0,$AA240*(1-Settings!$B$3),\"\"),\"\")","v":""},"",null,null,null,null,"","","",0,"",0,0,{"$f":"IF($C240<>\"\",GetStockNumParam($C240,\"h\"),\"\")","v":""},0,"",""]
["",null,null,null,null,null,null,null,null,null,null,"","","","","",{"$f":"IFERROR(IF($F241>0,IF($B$6=\"Canada\",IF($E241=\"CAD\",$F241*((Settings!$B$2)+1),$F241*$E$9*((Settings!$B$2)+1)), IF($E241=\"USD\",$F241*((Settings!$B$2)+1),$F241*$E$9*((Settings!$B$2)+1))),””),\"\")","v":""},{"$f":"IFERROR(IF($F241>0,$AA241*(1-Settings!$B$3),\"\"),\"\")","v":""},"",null,null,null,null,"","","",0,"",0,0,{"$f":"IF($C241<>\"\",GetStockNumParam($C241,\"h\"),\"\")","v":""},0,"",""]
["",null,null,null,null,null,null,null,null,null,null,"","","","","",{"$f":"IFERROR(IF($F242>0,IF($B$6=\"Canada\",IF($E242=\"CAD\",$F242*((Settings!$B$2)+1),$F242*$E$9*((Settings!$B$2)+1)), IF($E242=\"USD\",$F242*((Settings!$B$2)+1),$F242*$E$9*((Settings!$B$2)+1))),””),\"\")","v":""},{"$f":"IFERROR(IF($F242>0,$AA242*(1-Settings!$B$3),\"\"),\"\")","v":""},"",null,null,null,null,"","","",0,"",0,0,{"$f":"IF($C242<>\"\",GetStockNumParam($C242,\"h\"),\"\")","v":""},0,"",""]
["",null,null,null,null,null,null,null,null,null,null,"","","","","",{"$f":"IFERROR(IF($F243>0,IF($B$6=\"Canada\",IF($E243=\"CAD\",$F243*((Settings!$B$2)+1),$F243*$E$9*((Settings!$B$2)+1)), IF($E243=\"USD\",$F243*((Settings!$B$2)+1),$F243*$E$9*((Settings!$B$2)+1))),””),\"\")","v":""},{"$f":"IFERROR(IF($F243>0,$AA243*(1-Settings!$B$3),\"\"),\"\")","v":""},"",null,null,null,null,"","","",0,"",0,0,{"$f":"IF($C243<>\"\",GetStockNumParam($C243,\"h\"),\"\")","v":""},0,"",""]
["",null,null,null,null,null,null,null,null,null,null,"","","","","",{"$f":"IFERROR(IF($F244>0,IF($B$6=\"Canada\",IF($E244=\"CAD\",$F244*((Settings!$B$2)+1),$F244*$E$9*((Settings!$B$2)+1)), IF($E244=\"USD\",$F244*((Settings!$B$2)+1),$F244*$E$9*((Settings!$B$2)+1))),””),\"\")","v":""},{"$f":"IFERROR(IF($F244>0,$AA244*(1-Settings!$B$3),\"\"),\"\")","v":""},"",null,null,null,null,"","","",0,"",0,0,{"$f":"IF($C244<>\"\",GetStockNumParam($C244,\"h\"),\"\")","v":""},0,"",""]
["",null,null,null,null,null,null,null,null,null,null,"","","","","",{"$f":"IFERROR(IF($F245>0,IF($B$6=\"Canada\",IF($E245=\"CAD\",$F245*((Settings!$B$2)+1),$F245*$E$9*((Settings!$B$2)+1)), IF($E245=\"USD\",$F245*((Settings!$B$2)+1),$F245*$E$9*((Settings!$B$2)+1))),””),\"\")","v":""},{"$f":"IFERROR(IF($F245>0,$AA245*(1-Settings!$B$3),\"\"),\"\")","v":""},"",null,null,null,null,"","","",0,"",0,0,{"$f":"IF($C245<>\"\",GetStockNumParam($C245,\"h\"),\"\")","v":""},0,"",""]
["",null,null,null,null,null,null,null,null,null,null,"","","","","",{"$f":"IFERROR(IF($F246>0,IF($B$6=\"Canada\",IF($E246=\"CAD\",$F246*((Settings!$B$2)+1),$F246*$E$9*((Settings!$B$2)+1)), IF($E246=\"USD\",$F246*((Settings!$B$2)+1),$F246*$E$9*((Settings!$B$2)+1))),””),\"\")","v":""},{"$f":"IFERROR(IF($F246>0,$AA246*(1-Settings!$B$3),\"\"),\"\")","v":""},"",null,null,null,null,"","","",0,"",0,0,{"$f":"IF($C246<>\"\",GetStockNumParam($C246,\"h\"),\"\")","v":""},0,"",""]
["",null,null,null,null,null,null,null,null,null,null,"","","","","",{"$f":"IFERROR(IF($F247>0,IF($B$6=\"Canada\",IF($E247=\"CAD\",$F247*((Settings!$B$2)+1),$F247*$E$9*((Settings!$B$2)+1)), IF($E247=\"USD\",$F247*((Settings!$B$2)+1),$F247*$E$9*((Settings!$B$2)+1))),””),\"\")","v":""},{"$f":"IFERROR(IF($F247>0,$AA247*(1-Settings!$B$3),\"\"),\"\")","v":""},"",null,null,null,null,"","","",0,"",0,0,{"$f":"IF($C247<>\"\",GetStockNumParam($C247,\"h\"),\"\")","v":""},0,"",""]
["",null,null,null,null,null,null,null,null,null,null,"","","","","",{"$f":"IFERROR(IF($F248>0,IF($B$6=\"Canada\",IF($E248=\"CAD\",$F248*((Settings!$B$2)+1),$F248*$E$9*((Settings!$B$2)+1)), IF($E248=\"USD\",$F248*((Settings!$B$2)+1),$F248*$E$9*((Settings!$B$2)+1))),””),\"\")","v":""},{"$f":"IFERROR(IF($F248>0,$AA248*(1-Settings!$B$3),\"\"),\"\")","v":""},"",null,null,null,null,"","","",0,"",0,0,{"$f":"IF($C248<>\"\",GetStockNumParam($C248,\"h\"),\"\")","v":""},0,"",""]
["",null,null,null,null,null,null,null,null,null,null,"","","","","",{"$f":"IFERROR(IF($F249>0,IF($B$6=\"Canada\",IF($E249=\"CAD\",$F249*((Settings!$B$2)+1),$F249*$E$9*((Settings!$B$2)+1)), IF($E249=\"USD\",$F249*((Settings!$B$2)+1),$F249*$E$9*((Settings!$B$2)+1))),””),\"\")","v":""},{"$f":"IFERROR(IF($F249>0,$AA249*(1-Settings!$B$3),\"\"),\"\")","v":""},"",null,null,null,null,"","","",0,"",0,0,{"$f":"IF($C249<>\"\",GetStockNumParam($C249,\"h\"),\"\")","v":""},0,"",""]
["",null,null,null,null,null,null,null,null,null,null,"","","","","",{"$f":"IFERROR(IF($F250>0,IF($B$6=\"Canada\",IF($E250=\"CAD\",$F250*((Settings!$B$2)+1),$F250*$E$9*((Settings!$B$2)+1)), IF($E250=\"USD\",$F250*((Settings!$B$2)+1),$F250*$E$9*((Settings!$B$2)+1))),””),\"\")","v":""},{"$f":"IFERROR(IF($F250>0,$AA250*(1-Settings!$B$3),\"\"),\"\")","v":""},"",null,null,null,null,"","","",0,"",0,0,{"$f":"IF($C250<>\"\",GetStockNumParam($C250,\"h\"),\"\")","v":""},0,"",""]
["",null,null,null,null,null,null,null,null,null,null,"","","","","",{"$f":"IFERROR(IF($F251>0,IF($B$6=\"Canada\",IF($E251=\"CAD\",$F251*((Settings!$B$2)+1),$F251*$E$9*((Settings!$B$2)+1)), IF($E251=\"USD\",$F251*((Settings!$B$2)+1),$F251*$E$9*((Settings!$B$2)+1))),””),\"\")","v":""},{"$f":"IFERROR(IF($F251>0,$AA251*(1-Settings!$B$3),\"\"),\"\")","v":""},"",null,null,null,null,"","","",0,"",0,0,{"$f":"IF($C251<>\"\",GetStockNumParam($C251,\"h\"),\"\")","v":""},0,"",""]
["",null,null,null,null,null,null,null,null,null,null,"","","","","",{"$f":"IFERROR(IF($F252>0,IF($B$6=\"Canada\",IF($E252=\"CAD\",$F252*((Settings!$B$2)+1),$F252*$E$9*((Settings!$B$2)+1)), IF($E252=\"USD\",$F252*((Settings!$B$2)+1),$F252*$E$9*((Settings!$B$2)+1))),””),\"\")","v":""},{"$f":"IFERROR(IF($F252>0,$AA252*(1-Settings!$B$3),\"\"),\"\")","v":""},"",null,null,null,null,"","","",0,"",0,0,{"$f":"IF($C252<>\"\",GetStockNumParam($C252,\"h\"),\"\")","v":""},0,"",""]
["",null,null,null,null,null,null,null,null,null,null,"","","","","",{"$f":"IFERROR(IF($F253>0,IF($B$6=\"Canada\",IF($E253=\"CAD\",$F253*((Settings!$B$2)+1),$F253*$E$9*((Settings!$B$2)+1)), IF($E253=\"USD\",$F253*((Settings!$B$2)+1),$F253*$E$9*((Settings!$B$2)+1))),””),\"\")","v":""},{"$f":"IFERROR(IF($F253>0,$AA253*(1-Settings!$B$3),\"\"),\"\")","v":""},"",null,null,null,null,"","","",0,"",0,0,{"$f":"IF($C253<>\"\",GetStockNumParam($C253,\"h\"),\"\")","v":""},0,"",""]
["",null,null,null,null,null,null,null,null,null,null,"","","","","",{"$f":"IFERROR(IF($F254>0,IF($B$6=\"Canada\",IF($E254=\"CAD\",$F254*((Settings!$B$2)+1),$F254*$E$9*((Settings!$B$2)+1)), IF($E254=\"USD\",$F254*((Settings!$B$2)+1),$F254*$E$9*((Settings!$B$2)+1))),””),\"\")","v":""},{"$f":"IFERROR(IF($F254>0,$AA254*(1-Settings!$B$3),\"\"),\"\")","v":""},"",null,null,null,null,"","","",0,"",0,0,{"$f":"IF($C254<>\"\",GetStockNumParam($C254,\"h\"),\"\")","v":""},0,"",""]
["",null,null,null,null,null,null,null,null,null,null,"","","","","",{"$f":"IFERROR(IF($F255>0,IF($B$6=\"Canada\",IF($E255=\"CAD\",$F255*((Settings!$B$2)+1),$F255*$E$9*((Settings!$B$2)+1)), IF($E255=\"USD\",$F255*((Settings!$B$2)+1),$F255*$E$9*((Settings!$B$2)+1))),””),\"\")","v":""},{"$f":"IFERROR(IF($F255>0,$AA255*(1-Settings!$B$3),\"\"),\"\")","v":""},"",null,null,null,null,"","","",0,"",0,0,{"$f":"IF($C255<>\"\",GetStockNumParam($C255,\"h\"),\"\")","v":""},0,"",""]
["",null,null,null,null,null,null,null,null,null,null,"","","","","",{"$f":"IFERROR(IF($F256>0,IF($B$6=\"Canada\",IF($E256=\"CAD\",$F256*((Settings!$B$2)+1),$F256*$E$9*((Settings!$B$2)+1)), IF($E256=\"USD\",$F256*((Settings!$B$2)+1),$F256*$E$9*((Settings!$B$2)+1))),””),\"\")","v":""},{"$f":"IFERROR(IF($F256>0,$AA256*(1-Settings!$B$3),\"\"),\"\")","v":""},"",null,null,null,null,"","","",0,"",0,0,{"$f":"IF($C256<>\"\",GetStockNumParam($C256,\"h\"),\"\")","v":""},0,"",""]
["",null,null,null,null,null,null,null,null,null,null,"","","","","",{"$f":"IFERROR(IF($F257>0,IF($B$6=\"Canada\",IF($E257=\"CAD\",$F257*((Settings!$B$2)+1),$F257*$E$9*((Settings!$B$2)+1)), IF($E257=\"USD\",$F257*((Settings!$B$2)+1),$F257*$E$9*((Settings!$B$2)+1))),””),\"\")","v":""},{"$f":"IFERROR(IF($F257>0,$AA257*(1-Settings!$B$3),\"\"),\"\")","v":""},"",null,null,null,null,"","","",0,"",0,0,{"$f":"IF($C257<>\"\",GetStockNumParam($C257,\"h\"),\"\")","v":""},0,"",""]
["",null,null,null,null,null,null,null,null,null,null,"","","","","",{"$f":"IFERROR(IF($F258>0,IF($B$6=\"Canada\",IF($E258=\"CAD\",$F258*((Settings!$B$2)+1),$F258*$E$9*((Settings!$B$2)+1)), IF($E258=\"USD\",$F258*((Settings!$B$2)+1),$F258*$E$9*((Settings!$B$2)+1))),””),\"\")","v":""},{"$f":"IFERROR(IF($F258>0,$AA258*(1-Settings!$B$3),\"\"),\"\")","v":""},"",null,null,null,null,"","","",0,"",0,0,{"$f":"IF($C258<>\"\",GetStockNumParam($C258,\"h\"),\"\")","v":""},0,"",""]
["",null,null,null,null,null,null,null,null,null,null,"","","","","",{"$f":"IFERROR(IF($F259>0,IF($B$6=\"Canada\",IF($E259=\"CAD\",$F259*((Settings!$B$2)+1),$F259*$E$9*((Settings!$B$2)+1)), IF($E259=\"USD\",$F259*((Settings!$B$2)+1),$F259*$E$9*((Settings!$B$2)+1))),””),\"\")","v":""},{"$f":"IFERROR(IF($F259>0,$AA259*(1-Settings!$B$3),\"\"),\"\")","v":""},"",null,null,null,null,"","","",0,"",0,0,{"$f":"IF($C259<>\"\",GetStockNumParam($C259,\"h\"),\"\")","v":""},0,"",""]
["",null,null,null,null,null,null,null,null,null,null,"","","","","",{"$f":"IFERROR(IF($F260>0,IF($B$6=\"Canada\",IF($E260=\"CAD\",$F260*((Settings!$B$2)+1),$F260*$E$9*((Settings!$B$2)+1)), IF($E260=\"USD\",$F260*((Settings!$B$2)+1),$F260*$E$9*((Settings!$B$2)+1))),””),\"\")","v":""},{"$f":"IFERROR(IF($F260>0,$AA260*(1-Settings!$B$3),\"\"),\"\")","v":""},"",null,null,null,null,"","","",0,"",0,0,{"$f":"IF($C260<>\"\",GetStockNumParam($C260,\"h\"),\"\")","v":""},0,"",""]
["",null,null,null,null,null,null,null,null,null,null,"","","","","",{"$f":"IFERROR(IF($F261>0,IF($B$6=\"Canada\",IF($E261=\"CAD\",$F261*((Settings!$B$2)+1),$F261*$E$9*((Settings!$B$2)+1)), IF($E261=\"USD\",$F261*((Settings!$B$2)+1),$F261*$E$9*((Settings!$B$2)+1))),””),\"\")","v":""},{"$f":"IFERROR(IF($F261>0,$AA261*(1-Settings!$B$3),\"\"),\"\")","v":""},"",null,null,null,null,"","","",0,"",0,0,{"$f":"IF($C261<>\"\",GetStockNumParam($C261,\"h\"),\"\")","v":""},0,"",""]
["",null,null,null,null,null,null,null,null,null,null,"","","","","",{"$f":"IFERROR(IF($F262>0,IF($B$6=\"Canada\",IF($E262=\"CAD\",$F262*((Settings!$B$2)+1),$F262*$E$9*((Settings!$B$2)+1)), IF($E262=\"USD\",$F262*((Settings!$B$2)+1),$F262*$E$9*((Settings!$B$2)+1))),””),\"\")","v":""},{"$f":"IFERROR(IF($F262>0,$AA262*(1-Settings!$B$3),\"\"),\"\")","v":""},"",null,null,null,null,"","","",0,"",0,0,{"$f":"IF($C262<>\"\",GetStockNumParam($C262,\"h\"),\"\")","v":""},0,"",""]
["",null,null,null,null,null,null,null,null,null,null,"","","","","",{"$f":"IFERROR(IF($F263>0,IF($B$6=\"Canada\",IF($E263=\"CAD\",$F263*((Settings!$B$2)+1),$F263*$E$9*((Settings!$B$2)+1)), IF($E263=\"USD\",$F263*((Settings!$B$2)+1),$F263*$E$9*((Settings!$B$2)+1))),””),\"\")","v":""},{"$f":"IFERROR(IF($F263>0,$AA263*(1-Settings!$B$3),\"\"),\"\")","v":""},"",null,null,null,null,"","","",0,"",0,0,{"$f":"IF($C263<>\"\",GetStockNumParam($C263,\"h\"),\"\")","v":""},0,"",""]
["",null,null,null,null,null,null,null,null,null,null,"","","","","",{"$f":"IFERROR(IF($F264>0,IF($B$6=\"Canada\",IF($E264=\"CAD\",$F264*((Settings!$B$2)+1),$F264*$E$9*((Settings!$B$2)+1)), IF($E264=\"USD\",$F264*((Settings!$B$2)+1),$F264*$E$9*((Settings!$B$2)+1))),””),\"\")","v":""},{"$f":"IFERROR(IF($F264>0,$AA264*(1-Settings!$B$3),\"\"),\"\")","v":""},"",null,null,null,null,"","","",0,"",0,0,{"$f":"IF($C264<>\"\",GetStockNumParam($C264,\"h\"),\"\")","v":""},0,"",""]
["",null,null,null,null,null,null,null,null,null,null,"","","","","",{"$f":"IFERROR(IF($F265>0,IF($B$6=\"Canada\",IF($E265=\"CAD\",$F265*((Settings!$B$2)+1),$F265*$E$9*((Settings!$B$2)+1)), IF($E265=\"USD\",$F265*((Settings!$B$2)+1),$F265*$E$9*((Settings!$B$2)+1))),””),\"\")","v":""},{"$f":"IFERROR(IF($F265>0,$AA265*(1-Settings!$B$3),\"\"),\"\")","v":""},"",null,null,null,null,"","","",0,"",0,0,{"$f":"IF($C265<>\"\",GetStockNumParam($C265,\"h\"),\"\")","v":""},0,"",""]
["",null,null,null,null,null,null,null,null,null,null,"","","","","",{"$f":"IFERROR(IF($F266>0,IF($B$6=\"Canada\",IF($E266=\"CAD\",$F266*((Settings!$B$2)+1),$F266*$E$9*((Settings!$B$2)+1)), IF($E266=\"USD\",$F266*((Settings!$B$2)+1),$F266*$E$9*((Settings!$B$2)+1))),””),\"\")","v":""},{"$f":"IFERROR(IF($F266>0,$AA266*(1-Settings!$B$3),\"\"),\"\")","v":""},"",null,null,null,null,"","","",0,"",0,0,{"$f":"IF($C266<>\"\",GetStockNumParam($C266,\"h\"),\"\")","v":""},0,"",""]
["",null,null,null,null,null,null,null,null,null,null,{"$f":"IF(J267 > 0,K267-J267,\"\")","v":""},"",{"$f":"IF(D267 > 0,IF(T267 > 0,\"SOLD\",D267*K267),\"\")","v":""},{"$f":"IF(D267 > 0,IF(T267 > 0, Z267-I267, N267-I267),\"\")","v":""},{"$f":"IF(D267 > 0,IF(O267=0,0,(O267/I267)),\"\")","v":""},{"$f":"IFERROR(IF($F267>0,IF($B$6=\"Canada\",IF($E267=\"CAD\",$F267*((Settings!$B$2)+1),$F267*$E$9*((Settings!$B$2)+1)), IF($E267=\"USD\",$F267*((Settings!$B$2)+1),$F267*$E$9*((Settings!$B$2)+1))),””),\"\")","v":""},{"$f":"IFERROR(IF($F267>0,$AA267*(1-Settings!$B$3),\"\"),\"\")","v":""},{"$f":"IF(F267>0,IF(K267>=Q267,\"SELL\",IF(K267<=R267,\"STOP\",\"HOLD\")),\"\")","v":""},null,null,null,null,{"$f":"IF(D267 > 0,IF(Z267 = 0,0,Z267-I267),\"\")","v":""},{"$f":"IF(D267 > 0,IF(Z267=0,0,(Z267/I267)-100%),\"\")","v":""},{"$f":"IF(T267 > 0,T267*D267-V267+W267,N267)","v":""},0,"",0,{"$f":"IF(N267 = \"SOLD\", Z267-I267,I267)","v":0},{"$f":"IF($C267<>\"\",GetStockNumParam($C267,\"h\"),\"\")","v":""},0,"",""]
[{"$f":"IF($C268=\"\",\"\",GetName($C268))","v":""},null,null,null,null,null,null,null,null,null,null,"",{"$f":"IF(J268 > 0,(L268/J268),\"\")","v":""},"","","",{"$f":"IFERROR(IF($F268>0,IF($B$6=\"Canada\",IF($E268=\"CAD\",$F268*((Settings!$B$2)+1),$F268*$E$9*((Settings!$B$2)+1)), IF($E268=\"USD\",$F268*((Settings!$B$2)+1),$F268*$E$9*((Settings!$B$2)+1))),””),\"\")","v":""},{"$f":"IFERROR(IF($F268>0,$AA268*(1-Settings!$B$3),\"\"),\"\")","v":""},"",null,null,null,null,"","","",{"$f":"IF($B$6=\"Canada\",\nIF($E268=\"CAD\",IF($F268>$K268,$F268,$K268),IF(($F268*$E$9)>$K268,($F268*$E$9),$K268)),\nIF($E268=\"CAD\",IF(($F268*$E$9)>$K268,($F268*$E$9),$K268),IF($F268>$K268,$F268,$K268)))","v":0},{"$f":"IF($B268=\"Simulate\",0,IF(N268 = \"SOLD\", 0, N268))","v":""},{"$f":"IF($B268=\"Simulate\",0,IF(N268 = \"SOLD\",0,I268))","v":0},0,{"$f":"IF($C268<>\"\",GetStockNumParam($C268,\"h\"),\"\")","v":""},{"$f":"IF($B268=\"Simulate\",0,$I268)","v":0},{"$f":"IF($B268=\"Simulate\",0,Z268)","v":""},{"$f":"IF($B268=\"Simulate\",\"\",$O268)","v":""}]
["",null,null,null,null,null,null,null,null,null,null,"","","","","",{"$f":"IFERROR(IF($F269>0,IF($B$6=\"Canada\",IF($E269=\"CAD\",$F269*((Settings!$B$2)+1),$F269*$E$9*((Settings!$B$2)+1)), IF($E269=\"USD\",$F269*((Settings!$B$2)+1),$F269*$E$9*((Settings!$B$2)+1))),””),\"\")","v":""},{"$f":"IFERROR(IF($F269>0,$AA269*(1-Settings!$B$3),\"\"),\"\")","v":""},"",null,null,null,null,"","","",0,"",0,0,{"$f":"IF($C269<>\"\",GetStockNumParam($C269,\"h\"),\"\")","v":""},0,"",""]
["",null,null,null,null,null,null,null,null,null,null,"","","","","",{"$f":"IFERROR(IF($F270>0,IF($B$6=\"Canada\",IF($E270=\"CAD\",$F270*((Settings!$B$2)+1),$F270*$E$9*((Settings!$B$2)+1)), IF($E270=\"USD\",$F270*((Settings!$B$2)+1),$F270*$E$9*((Settings!$B$2)+1))),””),\"\")","v":""},{"$f":"IFERROR(IF($F270>0,$AA270*(1-Settings!$B$3),\"\"),\"\")","v":""},"",null,null,null,null,"","","",0,"",0,0,{"$f":"IF($C270<>\"\",GetStockNumParam($C270,\"h\"),\"\")","v":""},0,"",""]
["",null,null,null,null,null,null,null,null,null,null,"","","","","",{"$f":"IFERROR(IF($F271>0,IF($B$6=\"Canada\",IF($E271=\"CAD\",$F271*((Settings!$B$2)+1),$F271*$E$9*((Settings!$B$2)+1)), IF($E271=\"USD\",$F271*((Settings!$B$2)+1),$F271*$E$9*((Settings!$B$2)+1))),””),\"\")","v":""},{"$f":"IFERROR(IF($F271>0,$AA271*(1-Settings!$B$3),\"\"),\"\")","v":""},"",null,null,null,null,"","","",0,"",0,0,{"$f":"IF($C271<>\"\",GetStockNumParam($C271,\"h\"),\"\")","v":""},0,"",""]
["",null,null,null,null,null,null,null,null,null,null,"","","","","",{"$f":"IFERROR(IF($F272>0,IF($B$6=\"Canada\",IF($E272=\"CAD\",$F272*((Settings!$B$2)+1),$F272*$E$9*((Settings!$B$2)+1)), IF($E272=\"USD\",$F272*((Settings!$B$2)+1),$F272*$E$9*((Settings!$B$2)+1))),””),\"\")","v":""},{"$f":"IFERROR(IF($F272>0,$AA272*(1-Settings!$B$3),\"\"),\"\")","v":""},"",null,null,null,null,"","","",0,"",0,0,{"$f":"IF($C272<>\"\",GetStockNumParam($C272,\"h\"),\"\")","v":""},0,"",""]
["",null,null,null,null,null,null,null,null,null,null,"","","","","",{"$f":"IFERROR(IF($F273>0,IF($B$6=\"Canada\",IF($E273=\"CAD\",$F273*((Settings!$B$2)+1),$F273*$E$9*((Settings!$B$2)+1)), IF($E273=\"USD\",$F273*((Settings!$B$2)+1),$F273*$E$9*((Settings!$B$2)+1))),””),\"\")","v":""},{"$f":"IFERROR(IF($F273>0,$AA273*(1-Settings!$B$3),\"\"),\"\")","v":""},"",null,null,null,null,"","","",0,"",0,0,{"$f":"IF($C273<>\"\",GetStockNumParam($C273,\"h\"),\"\")","v":""},0,"",""]
["",null,null,null,null,null,null,null,null,null,null,"","","","","",{"$f":"IFERROR(IF($F274>0,IF($B$6=\"Canada\",IF($E274=\"CAD\",$F274*((Settings!$B$2)+1),$F274*$E$9*((Settings!$B$2)+1)), IF($E274=\"USD\",$F274*((Settings!$B$2)+1),$F274*$E$9*((Settings!$B$2)+1))),””),\"\")","v":""},{"$f":"IFERROR(IF($F274>0,$AA274*(1-Settings!$B$3),\"\"),\"\")","v":""},"",null,null,null,null,"","","",0,"",0,0,{"$f":"IF($C274<>\"\",GetStockNumParam($C274,\"h\"),\"\")","v":""},0,"",""]
["",null,null,null,null,null,null,null,null,null,null,"","","","","",{"$f":"IFERROR(IF($F275>0,IF($B$6=\"Canada\",IF($E275=\"CAD\",$F275*((Settings!$B$2)+1),$F275*$E$9*((Settings!$B$2)+1)), IF($E275=\"USD\",$F275*((Settings!$B$2)+1),$F275*$E$9*((Settings!$B$2)+1))),””),\"\")","v":""},{"$f":"IFERROR(IF($F275>0,$AA275*(1-Settings!$B$3),\"\"),\"\")","v":""},"",null,null,null,null,"","","",0,"",0,0,{"$f":"IF($C275<>\"\",GetStockNumParam($C275,\"h\"),\"\")","v":""},0,"",""]
["",null,null,null,null,null,null,null,null,null,null,"","","","","",{"$f":"IFERROR(IF($F276>0,IF($B$6=\"Canada\",IF($E276=\"CAD\",$F276*((Settings!$B$2)+1),$F276*$E$9*((Settings!$B$2)+1)), IF($E276=\"USD\",$F276*((Settings!$B$2)+1),$F276*$E$9*((Settings!$B$2)+1))),””),\"\")","v":""},{"$f":"IFERROR(IF($F276>0,$AA276*(1-Settings!$B$3),\"\"),\"\")","v":""},"",null,null,null,null,"","","",0,"",0,0,{"$f":"IF($C276<>\"\",GetStockNumParam($C276,\"h\"),\"\")","v":""},0,"",""]
["",null,null,null,null,null,null,null,null,null,null,"","","","","",{"$f":"IFERROR(IF($F277>0,IF($B$6=\"Canada\",IF($E277=\"CAD\",$F277*((Settings!$B$2)+1),$F277*$E$9*((Settings!$B$2)+1)), IF($E277=\"USD\",$F277*((Settings!$B$2)+1),$F277*$E$9*((Settings!$B$2)+1))),””),\"\")","v":""},{"$f":"IFERROR(IF($F277>0,$AA277*(1-Settings!$B$3),\"\"),\"\")","v":""},"",null,null,null,null,"","","",0,"",0,0,{"$f":"IF($C277<>\"\",GetStockNumParam($C277,\"h\"),\"\")","v":""},0,"",""]
["",null,null,null,null,null,null,null,null,null,null,"","","","","",{"$f":"IFERROR(IF($F278>0,IF($B$6=\"Canada\",IF($E278=\"CAD\",$F278*((Settings!$B$2)+1),$F278*$E$9*((Settings!$B$2)+1)), IF($E278=\"USD\",$F278*((Settings!$B$2)+1),$F278*$E$9*((Settings!$B$2)+1))),””),\"\")","v":""},{"$f":"IFERROR(IF($F278>0,$AA278*(1-Settings!$B$3),\"\"),\"\")","v":""},"",null,null,null,null,"","","",0,"",0,0,{"$f":"IF($C278<>\"\",GetStockNumParam($C278,\"h\"),\"\")","v":""},0,"",""]
["",null,null,null,null,null,null,null,null,null,null,"","","","","",{"$f":"IFERROR(IF($F279>0,IF($B$6=\"Canada\",IF($E279=\"CAD\",$F279*((Settings!$B$2)+1),$F279*$E$9*((Settings!$B$2)+1)), IF($E279=\"USD\",$F279*((Settings!$B$2)+1),$F279*$E$9*((Settings!$B$2)+1))),””),\"\")","v":""},{"$f":"IFERROR(IF($F279>0,$AA279*(1-Settings!$B$3),\"\"),\"\")","v":""},"",null,null,null,null,"","","",0,"",0,0,{"$f":"IF($C279<>\"\",GetStockNumParam($C279,\"h\"),\"\")","v":""},0,"",""]
["",null,null,null,null,null,null,null,null,null,null,"","","","","",{"$f":"IFERROR(IF($F280>0,IF($B$6=\"Canada\",IF($E280=\"CAD\",$F280*((Settings!$B$2)+1),$F280*$E$9*((Settings!$B$2)+1)), IF($E280=\"USD\",$F280*((Settings!$B$2)+1),$F280*$E$9*((Settings!$B$2)+1))),””),\"\")","v":""},{"$f":"IFERROR(IF($F280>0,$AA280*(1-Settings!$B$3),\"\"),\"\")","v":""},"",null,null,null,null,"","","",0,"",0,0,{"$f":"IF($C280<>\"\",GetStockNumParam($C280,\"h\"),\"\")","v":""},0,"",""]
["",null,null,null,null,null,null,null,null,null,null,"","","","","",{"$f":"IFERROR(IF($F281>0,IF($B$6=\"Canada\",IF($E281=\"CAD\",$F281*((Settings!$B$2)+1),$F281*$E$9*((Settings!$B$2)+1)), IF($E281=\"USD\",$F281*((Settings!$B$2)+1),$F281*$E$9*((Settings!$B$2)+1))),””),\"\")","v":""},{"$f":"IFERROR(IF($F281>0,$AA281*(1-Settings!$B$3),\"\"),\"\")","v":""},"",null,null,null,null,"","","",0,"",0,0,{"$f":"IF($C281<>\"\",GetStockNumParam($C281,\"h\"),\"\")","v":""},0,"",""]
["",null,null,null,null,null,null,null,null,null,null,"","","","","",{"$f":"IFERROR(IF($F282>0,IF($B$6=\"Canada\",IF($E282=\"CAD\",$F282*((Settings!$B$2)+1),$F282*$E$9*((Settings!$B$2)+1)), IF($E282=\"USD\",$F282*((Settings!$B$2)+1),$F282*$E$9*((Settings!$B$2)+1))),””),\"\")","v":""},{"$f":"IFERROR(IF($F282>0,$AA282*(1-Settings!$B$3),\"\"),\"\")","v":""},"",null,null,null,null,"","","",0,"",0,0,{"$f":"IF($C282<>\"\",GetStockNumParam($C282,\"h\"),\"\")","v":""},0,"",""]
["",null,null,null,null,null,null,null,null,null,null,"","","","","",{"$f":"IFERROR(IF($F283>0,IF($B$6=\"Canada\",IF($E283=\"CAD\",$F283*((Settings!$B$2)+1),$F283*$E$9*((Settings!$B$2)+1)), IF($E283=\"USD\",$F283*((Settings!$B$2)+1),$F283*$E$9*((Settings!$B$2)+1))),””),\"\")","v":""},{"$f":"IFERROR(IF($F283>0,$AA283*(1-Settings!$B$3),\"\"),\"\")","v":""},"",null,null,null,null,"","","",0,"",0,0,{"$f":"IF($C283<>\"\",GetStockNumParam($C283,\"h\"),\"\")","v":""},0,"",""]
["",null,null,null,null,null,null,null,null,null,null,"","","","","",{"$f":"IFERROR(IF($F284>0,IF($B$6=\"Canada\",IF($E284=\"CAD\",$F284*((Settings!$B$2)+1),$F284*$E$9*((Settings!$B$2)+1)), IF($E284=\"USD\",$F284*((Settings!$B$2)+1),$F284*$E$9*((Settings!$B$2)+1))),””),\"\")","v":""},{"$f":"IFERROR(IF($F284>0,$AA284*(1-Settings!$B$3),\"\"),\"\")","v":""},"",null,null,null,null,"","","",0,"",0,0,{"$f":"IF($C284<>\"\",GetStockNumParam($C284,\"h\"),\"\")","v":""},0,"",""]
["",null,null,null,null,null,null,null,null,null,null,"","","","","",{"$f":"IFERROR(IF($F285>0,IF($B$6=\"Canada\",IF($E285=\"CAD\",$F285*((Settings!$B$2)+1),$F285*$E$9*((Settings!$B$2)+1)), IF($E285=\"USD\",$F285*((Settings!$B$2)+1),$F285*$E$9*((Settings!$B$2)+1))),””),\"\")","v":""},{"$f":"IFERROR(IF($F285>0,$AA285*(1-Settings!$B$3),\"\"),\"\")","v":""},"",null,null,null,null,"","","",0,"",0,0,{"$f":"IF($C285<>\"\",GetStockNumParam($C285,\"h\"),\"\")","v":""},0,"",""]
["",null,null,null,null,null,null,null,null,null,null,"","","","","",{"$f":"IFERROR(IF($F286>0,IF($B$6=\"Canada\",IF($E286=\"CAD\",$F286*((Settings!$B$2)+1),$F286*$E$9*((Settings!$B$2)+1)), IF($E286=\"USD\",$F286*((Settings!$B$2)+1),$F286*$E$9*((Settings!$B$2)+1))),””),\"\")","v":""},{"$f":"IFERROR(IF($F286>0,$AA286*(1-Settings!$B$3),\"\"),\"\")","v":""},"",null,null,null,null,"","","",0,"",0,0,{"$f":"IF($C286<>\"\",GetStockNumParam($C286,\"h\"),\"\")","v":""},0,"",""]
["",null,null,null,null,null,null,null,null,null,null,"","","","","",{"$f":"IFERROR(IF($F287>0,IF($B$6=\"Canada\",IF($E287=\"CAD\",$F287*((Settings!$B$2)+1),$F287*$E$9*((Settings!$B$2)+1)), IF($E287=\"USD\",$F287*((Settings!$B$2)+1),$F287*$E$9*((Settings!$B$2)+1))),””),\"\")","v":""},{"$f":"IFERROR(IF($F287>0,$AA287*(1-Settings!$B$3),\"\"),\"\")","v":""},"",null,null,null,null,"","","",0,"",0,0,{"$f":"IF($C287<>\"\",GetStockNumParam($C287,\"h\"),\"\")","v":""},0,"",""]
["",null,null,null,null,null,null,null,null,null,null,"","","","","",{"$f":"IFERROR(IF($F288>0,IF($B$6=\"Canada\",IF($E288=\"CAD\",$F288*((Settings!$B$2)+1),$F288*$E$9*((Settings!$B$2)+1)), IF($E288=\"USD\",$F288*((Settings!$B$2)+1),$F288*$E$9*((Settings!$B$2)+1))),””),\"\")","v":""},{"$f":"IFERROR(IF($F288>0,$AA288*(1-Settings!$B$3),\"\"),\"\")","v":""},"",null,null,null,null,"","","",0,"",0,0,{"$f":"IF($C288<>\"\",GetStockNumParam($C288,\"h\"),\"\")","v":""},0,"",""]
["",null,null,null,null,null,null,null,null,null,null,"","","","","",{"$f":"IFERROR(IF($F289>0,IF($B$6=\"Canada\",IF($E289=\"CAD\",$F289*((Settings!$B$2)+1),$F289*$E$9*((Settings!$B$2)+1)), IF($E289=\"USD\",$F289*((Settings!$B$2)+1),$F289*$E$9*((Settings!$B$2)+1))),””),\"\")","v":""},{"$f":"IFERROR(IF($F289>0,$AA289*(1-Settings!$B$3),\"\"),\"\")","v":""},"",null,null,null,null,"","","",0,"",0,0,{"$f":"IF($C289<>\"\",GetStockNumParam($C289,\"h\"),\"\")","v":""},0,"",""]
["",null,null,null,null,null,null,null,null,null,null,"","","","","",{"$f":"IFERROR(IF($F290>0,IF($B$6=\"Canada\",IF($E290=\"CAD\",$F290*((Settings!$B$2)+1),$F290*$E$9*((Settings!$B$2)+1)), IF($E290=\"USD\",$F290*((Settings!$B$2)+1),$F290*$E$9*((Settings!$B$2)+1))),””),\"\")","v":""},{"$f":"IFERROR(IF($F290>0,$AA290*(1-Settings!$B$3),\"\"),\"\")","v":""},"",null,null,null,null,"","","",0,"",0,0,{"$f":"IF($C290<>\"\",GetStockNumParam($C290,\"h\"),\"\")","v":""},0,"",""]
["",null,null,null,null,null,null,null,null,null,null,"","","","","",{"$f":"IFERROR(IF($F291>0,IF($B$6=\"Canada\",IF($E291=\"CAD\",$F291*((Settings!$B$2)+1),$F291*$E$9*((Settings!$B$2)+1)), IF($E291=\"USD\",$F291*((Settings!$B$2)+1),$F291*$E$9*((Settings!$B$2)+1))),””),\"\")","v":""},{"$f":"IFERROR(IF($F291>0,$AA291*(1-Settings!$B$3),\"\"),\"\")","v":""},"",null,null,null,null,"","","",0,"",0,0,{"$f":"IF($C291<>\"\",GetStockNumParam($C291,\"h\"),\"\")","v":""},0,"",""]
["",null,null,null,null,null,null,null,null,null,null,"","","","","",{"$f":"IFERROR(IF($F292>0,IF($B$6=\"Canada\",IF($E292=\"CAD\",$F292*((Settings!$B$2)+1),$F292*$E$9*((Settings!$B$2)+1)), IF($E292=\"USD\",$F292*((Settings!$B$2)+1),$F292*$E$9*((Settings!$B$2)+1))),””),\"\")","v":""},{"$f":"IFERROR(IF($F292>0,$AA292*(1-Settings!$B$3),\"\"),\"\")","v":""},"",null,null,null,null,"","","",0,"",0,0,{"$f":"IF($C292<>\"\",GetStockNumParam($C292,\"h\"),\"\")","v":""},0,"",""]
["",null,null,null,null,null,null,null,null,null,null,"","","","","",{"$f":"IFERROR(IF($F293>0,IF($B$6=\"Canada\",IF($E293=\"CAD\",$F293*((Settings!$B$2)+1),$F293*$E$9*((Settings!$B$2)+1)), IF($E293=\"USD\",$F293*((Settings!$B$2)+1),$F293*$E$9*((Settings!$B$2)+1))),””),\"\")","v":""},{"$f":"IFERROR(IF($F293>0,$AA293*(1-Settings!$B$3),\"\"),\"\")","v":""},"",null,null,null,null,"","","",0,"",0,0,{"$f":"IF($C293<>\"\",GetStockNumParam($C293,\"h\"),\"\")","v":""},0,"",""]
["",null,null,null,null,null,null,null,null,null,null,"","","","","",{"$f":"IFERROR(IF($F294>0,IF($B$6=\"Canada\",IF($E294=\"CAD\",$F294*((Settings!$B$2)+1),$F294*$E$9*((Settings!$B$2)+1)), IF($E294=\"USD\",$F294*((Settings!$B$2)+1),$F294*$E$9*((Settings!$B$2)+1))),””),\"\")","v":""},{"$f":"IFERROR(IF($F294>0,$AA294*(1-Settings!$B$3),\"\"),\"\")","v":""},"",null,null,null,null,"","","",0,"",0,0,{"$f":"IF($C294<>\"\",GetStockNumParam($C294,\"h\"),\"\")","v":""},0,"",""]
["",null,null,null,null,null,null,null,null,null,null,"","","","","",{"$f":"IFERROR(IF($F295>0,IF($B$6=\"Canada\",IF($E295=\"CAD\",$F295*((Settings!$B$2)+1),$F295*$E$9*((Settings!$B$2)+1)), IF($E295=\"USD\",$F295*((Settings!$B$2)+1),$F295*$E$9*((Settings!$B$2)+1))),””),\"\")","v":""},{"$f":"IFERROR(IF($F295>0,$AA295*(1-Settings!$B$3),\"\"),\"\")","v":""},"",null,null,null,null,"","","",0,"",0,0,{"$f":"IF($C295<>\"\",GetStockNumParam($C295,\"h\"),\"\")","v":""},0,"",""]
["",null,null,null,null,null,null,null,null,null,null,"","","","","",{"$f":"IFERROR(IF($F296>0,IF($B$6=\"Canada\",IF($E296=\"CAD\",$F296*((Settings!$B$2)+1),$F296*$E$9*((Settings!$B$2)+1)), IF($E296=\"USD\",$F296*((Settings!$B$2)+1),$F296*$E$9*((Settings!$B$2)+1))),””),\"\")","v":""},{"$f":"IFERROR(IF($F296>0,$AA296*(1-Settings!$B$3),\"\"),\"\")","v":""},"",null,null,null,null,"","","",0,"",0,0,{"$f":"IF($C296<>\"\",GetStockNumParam($C296,\"h\"),\"\")","v":""},0,"",""]
["",null,null,null,null,null,null,null,null,null,null,"","","","","",{"$f":"IFERROR(IF($F297>0,IF($B$6=\"Canada\",IF($E297=\"CAD\",$F297*((Settings!$B$2)+1),$F297*$E$9*((Settings!$B$2)+1)), IF($E297=\"USD\",$F297*((Settings!$B$2)+1),$F297*$E$9*((Settings!$B$2)+1))),””),\"\")","v":""},{"$f":"IFERROR(IF($F297>0,$AA297*(1-Settings!$B$3),\"\"),\"\")","v":""},"",null,null,null,null,"","","",0,"",0,0,{"$f":"IF($C297<>\"\",GetStockNumParam($C297,\"h\"),\"\")","v":""},0,"",""]
["",null,null,null,null,null,null,null,null,null,null,"","","","","",{"$f":"IFERROR(IF($F298>0,IF($B$6=\"Canada\",IF($E298=\"CAD\",$F298*((Settings!$B$2)+1),$F298*$E$9*((Settings!$B$2)+1)), IF($E298=\"USD\",$F298*((Settings!$B$2)+1),$F298*$E$9*((Settings!$B$2)+1))),””),\"\")","v":""},{"$f":"IFERROR(IF($F298>0,$AA298*(1-Settings!$B$3),\"\"),\"\")","v":""},"",null,null,null,null,"","","",0,"",0,0,{"$f":"IF($C298<>\"\",GetStockNumParam($C298,\"h\"),\"\")","v":""},0,"",""]
["",null,null,null,null,null,null,null,null,null,null,"","","","","",{"$f":"IFERROR(IF($F299>0,IF($B$6=\"Canada\",IF($E299=\"CAD\",$F299*((Settings!$B$2)+1),$F299*$E$9*((Settings!$B$2)+1)), IF($E299=\"USD\",$F299*((Settings!$B$2)+1),$F299*$E$9*((Settings!$B$2)+1))),””),\"\")","v":""},{"$f":"IFERROR(IF($F299>0,$AA299*(1-Settings!$B$3),\"\"),\"\")","v":""},"",null,null,null,null,"","","",0,"",0,0,{"$f":"IF($C299<>\"\",GetStockNumParam($C299,\"h\"),\"\")","v":""},0,"",""]
["",null,null,null,null,null,null,null,null,null,null,"","","","","",{"$f":"IFERROR(IF($F300>0,IF($B$6=\"Canada\",IF($E300=\"CAD\",$F300*((Settings!$B$2)+1),$F300*$E$9*((Settings!$B$2)+1)), IF($E300=\"USD\",$F300*((Settings!$B$2)+1),$F300*$E$9*((Settings!$B$2)+1))),””),\"\")","v":""},{"$f":"IFERROR(IF($F300>0,$AA300*(1-Settings!$B$3),\"\"),\"\")","v":""},"",null,null,null,null,"","","",0,"",0,0,{"$f":"IF($C300<>\"\",GetStockNumParam($C300,\"h\"),\"\")","v":""},0,"",""]
["",null,null,null,null,null,null,null,null,null,null,"","","","","",{"$f":"IFERROR(IF($F301>0,IF($B$6=\"Canada\",IF($E301=\"CAD\",$F301*((Settings!$B$2)+1),$F301*$E$9*((Settings!$B$2)+1)), IF($E301=\"USD\",$F301*((Settings!$B$2)+1),$F301*$E$9*((Settings!$B$2)+1))),””),\"\")","v":""},{"$f":"IFERROR(IF($F301>0,$AA301*(1-Settings!$B$3),\"\"),\"\")","v":""},"",null,null,null,null,"","","",0,"",0,0,{"$f":"IF($C301<>\"\",GetStockNumParam($C301,\"h\"),\"\")","v":""},0,"",""]
["",null,null,null,null,null,null,null,null,null,null,"","","","","",{"$f":"IFERROR(IF($F302>0,IF($B$6=\"Canada\",IF($E302=\"CAD\",$F302*((Settings!$B$2)+1),$F302*$E$9*((Settings!$B$2)+1)), IF($E302=\"USD\",$F302*((Settings!$B$2)+1),$F302*$E$9*((Settings!$B$2)+1))),””),\"\")","v":""},{"$f":"IFERROR(IF($F302>0,$AA302*(1-Settings!$B$3),\"\"),\"\")","v":""},"",null,null,null,null,"","","",0,"",0,0,{"$f":"IF($C302<>\"\",GetStockNumParam($C302,\"h\"),\"\")","v":""},0,"",""]
["",null,null,null,null,null,null,null,null,null,null,"","","","","",{"$f":"IFERROR(IF($F303>0,IF($B$6=\"Canada\",IF($E303=\"CAD\",$F303*((Settings!$B$2)+1),$F303*$E$9*((Settings!$B$2)+1)), IF($E303=\"USD\",$F303*((Settings!$B$2)+1),$F303*$E$9*((Settings!$B$2)+1))),””),\"\")","v":""},{"$f":"IFERROR(IF($F303>0,$AA303*(1-Settings!$B$3),\"\"),\"\")","v":""},"",null,null,null,null,"","","",0,"",0,0,{"$f":"IF($C303<>\"\",GetStockNumParam($C303,\"h\"),\"\")","v":""},0,"",""]
["",null,null,null,null,null,null,null,null,null,null,"","","","","",{"$f":"IFERROR(IF($F304>0,IF($B$6=\"Canada\",IF($E304=\"CAD\",$F304*((Settings!$B$2)+1),$F304*$E$9*((Settings!$B$2)+1)), IF($E304=\"USD\",$F304*((Settings!$B$2)+1),$F304*$E$9*((Settings!$B$2)+1))),””),\"\")","v":""},{"$f":"IFERROR(IF($F304>0,$AA304*(1-Settings!$B$3),\"\"),\"\")","v":""},"",null,null,null,null,"","","",0,"",0,0,{"$f":"IF($C304<>\"\",GetStockNumParam($C304,\"h\"),\"\")","v":""},0,"",""]
["",null,null,null,null,null,null,null,null,null,null,"","","","","",{"$f":"IFERROR(IF($F305>0,IF($B$6=\"Canada\",IF($E305=\"CAD\",$F305*((Settings!$B$2)+1),$F305*$E$9*((Settings!$B$2)+1)), IF($E305=\"USD\",$F305*((Settings!$B$2)+1),$F305*$E$9*((Settings!$B$2)+1))),””),\"\")","v":""},{"$f":"IFERROR(IF($F305>0,$AA305*(1-Settings!$B$3),\"\"),\"\")","v":""},"",null,null,null,null,"","","",0,"",0,0,{"$f":"IF($C305<>\"\",GetStockNumParam($C305,\"h\"),\"\")","v":""},0,"",""]
["",null,null,null,null,null,null,null,null,null,null,"","","","","",{"$f":"IFERROR(IF($F306>0,IF($B$6=\"Canada\",IF($E306=\"CAD\",$F306*((Settings!$B$2)+1),$F306*$E$9*((Settings!$B$2)+1)), IF($E306=\"USD\",$F306*((Settings!$B$2)+1),$F306*$E$9*((Settings!$B$2)+1))),””),\"\")","v":""},{"$f":"IFERROR(IF($F306>0,$AA306*(1-Settings!$B$3),\"\"),\"\")","v":""},"",null,null,null,null,"","","",0,"",0,0,{"$f":"IF($C306<>\"\",GetStockNumParam($C306,\"h\"),\"\")","v":""},0,"",""]
["",null,null,null,null,null,null,null,null,null,null,"","","","","",{"$f":"IFERROR(IF($F307>0,IF($B$6=\"Canada\",IF($E307=\"CAD\",$F307*((Settings!$B$2)+1),$F307*$E$9*((Settings!$B$2)+1)), IF($E307=\"USD\",$F307*((Settings!$B$2)+1),$F307*$E$9*((Settings!$B$2)+1))),””),\"\")","v":""},{"$f":"IFERROR(IF($F307>0,$AA307*(1-Settings!$B$3),\"\"),\"\")","v":""},"",null,null,null,null,"","","",0,"",0,0,{"$f":"IF($C307<>\"\",GetStockNumParam($C307,\"h\"),\"\")","v":""},0,"",""]
["",null,null,null,null,null,null,null,null,null,null,"","","","","",{"$f":"IFERROR(IF($F308>0,IF($B$6=\"Canada\",IF($E308=\"CAD\",$F308*((Settings!$B$2)+1),$F308*$E$9*((Settings!$B$2)+1)), IF($E308=\"USD\",$F308*((Settings!$B$2)+1),$F308*$E$9*((Settings!$B$2)+1))),””),\"\")","v":""},{"$f":"IFERROR(IF($F308>0,$AA308*(1-Settings!$B$3),\"\"),\"\")","v":""},"",null,null,null,null,"","","",0,"",0,0,{"$f":"IF($C308<>\"\",GetStockNumParam($C308,\"h\"),\"\")","v":""},0,"",""]
["",null,null,null,null,null,null,null,null,null,null,"","","","","",{"$f":"IFERROR(IF($F309>0,IF($B$6=\"Canada\",IF($E309=\"CAD\",$F309*((Settings!$B$2)+1),$F309*$E$9*((Settings!$B$2)+1)), IF($E309=\"USD\",$F309*((Settings!$B$2)+1),$F309*$E$9*((Settings!$B$2)+1))),””),\"\")","v":""},{"$f":"IFERROR(IF($F309>0,$AA309*(1-Settings!$B$3),\"\"),\"\")","v":""},"",null,null,null,null,"","","",0,"",0,0,{"$f":"IF($C309<>\"\",GetStockNumParam($C309,\"h\"),\"\")","v":""},0,"",""]
["",null,null,null,null,null,null,null,null,null,null,"","","","","",{"$f":"IFERROR(IF($F310>0,IF($B$6=\"Canada\",IF($E310=\"CAD\",$F310*((Settings!$B$2)+1),$F310*$E$9*((Settings!$B$2)+1)), IF($E310=\"USD\",$F310*((Settings!$B$2)+1),$F310*$E$9*((Settings!$B$2)+1))),””),\"\")","v":""},{"$f":"IFERROR(IF($F310>0,$AA310*(1-Settings!$B$3),\"\"),\"\")","v":""},"",null,null,null,null,"","","",0,"",0,0,{"$f":"IF($C310<>\"\",GetStockNumParam($C310,\"h\"),\"\")","v":""},0,"",""]
["",null,null,null,null,null,null,null,null,null,null,"","","","","",{"$f":"IFERROR(IF($F311>0,IF($B$6=\"Canada\",IF($E311=\"CAD\",$F311*((Settings!$B$2)+1),$F311*$E$9*((Settings!$B$2)+1)), IF($E311=\"USD\",$F311*((Settings!$B$2)+1),$F311*$E$9*((Settings!$B$2)+1))),””),\"\")","v":""},{"$f":"IFERROR(IF($F311>0,$AA311*(1-Settings!$B$3),\"\"),\"\")","v":""},"",null,null,null,null,"","","",0,"",0,0,{"$f":"IF($C311<>\"\",GetStockNumParam($C311,\"h\"),\"\")","v":""},0,"",""]
["",null,null,null,null,null,null,null,null,null,null,"","","","","",{"$f":"IFERROR(IF($F312>0,IF($B$6=\"Canada\",IF($E312=\"CAD\",$F312*((Settings!$B$2)+1),$F312*$E$9*((Settings!$B$2)+1)), IF($E312=\"USD\",$F312*((Settings!$B$2)+1),$F312*$E$9*((Settings!$B$2)+1))),””),\"\")","v":""},{"$f":"IFERROR(IF($F312>0,$AA312*(1-Settings!$B$3),\"\"),\"\")","v":""},"",null,null,null,null,"","","",0,"",0,0,{"$f":"IF($C312<>\"\",GetStockNumParam($C312,\"h\"),\"\")","v":""},0,"",""]
["",null,null,null,null,null,null,null,null,null,null,{"$f":"IF(J313 > 0,K313-J313,\"\")","v":""},{"$f":"IF(J313 > 0,(L313/J313),\"\")","v":""},{"$f":"IF(D313 > 0,IF(T313 > 0,\"SOLD\",D313*K313),\"\")","v":""},{"$f":"IF(D313 > 0,IF(T313 > 0, Z313-I313, N313-I313),\"\")","v":""},{"$f":"IF(D313 > 0,IF(O313=0,0,(O313/I313)),\"\")","v":""},{"$f":"IFERROR(IF($F313>0,IF($B$6=\"Canada\",IF($E313=\"CAD\",$F313*((Settings!$B$2)+1),$F313*$E$9*((Settings!$B$2)+1)), IF($E313=\"USD\",$F313*((Settings!$B$2)+1),$F313*$E$9*((Settings!$B$2)+1))),””),\"\")","v":""},{"$f":"IFERROR(IF($F313>0,$AA313*(1-Settings!$B$3),\"\"),\"\")","v":""},{"$f":"IF(F313>0,IF(K313>=Q313,\"SELL\",IF(K313<=R313,\"STOP\",\"HOLD\")),\"\")","v":""},null,null,null,null,{"$f":"IF(D313 > 0,IF(Z313 = 0,0,Z313-I313),\"\")","v":""},{"$f":"IF(D313 > 0,IF(Z313=0,0,(Z313/I313)-100%),\"\")","v":""},{"$f":"IF(T313 > 0,T313*D313-V313+W313,N313)","v":""},0,"",0,{"$f":"IF(N313 = \"SOLD\", Z313-I313,I313)","v":0},{"$f":"IF($C313<>\"\",GetStockNumParam($C313,\"h\"),\"\")","v":""},0,"",""]
["",null,null,null,null,null,null,null,null,null,null,"","","","","",{"$f":"IFERROR(IF($F314>0,IF($B$6=\"Canada\",IF($E314=\"CAD\",$F314*((Settings!$B$2)+1),$F314*$E$9*((Settings!$B$2)+1)), IF($E314=\"USD\",$F314*((Settings!$B$2)+1),$F314*$E$9*((Settings!$B$2)+1))),””),\"\")","v":""},{"$f":"IFERROR(IF($F314>0,$AA314*(1-Settings!$B$3),\"\"),\"\")","v":""},"",null,null,null,null,"","","",0,"",0,0,{"$f":"IF($C314<>\"\",GetStockNumParam($C314,\"h\"),\"\")","v":""},0,"",""]
["",null,null,null,null,null,null,null,null,null,null,"","","","","",{"$f":"IFERROR(IF($F315>0,IF($B$6=\"Canada\",IF($E315=\"CAD\",$F315*((Settings!$B$2)+1),$F315*$E$9*((Settings!$B$2)+1)), IF($E315=\"USD\",$F315*((Settings!$B$2)+1),$F315*$E$9*((Settings!$B$2)+1))),””),\"\")","v":""},{"$f":"IFERROR(IF($F315>0,$AA315*(1-Settings!$B$3),\"\"),\"\")","v":""},"",null,null,null,null,"","","",0,"",0,0,{"$f":"IF($C315<>\"\",GetStockNumParam($C315,\"h\"),\"\")","v":""},0,"",""]
["",null,null,null,null,null,null,null,null,null,null,"","","","","",{"$f":"IFERROR(IF($F316>0,IF($B$6=\"Canada\",IF($E316=\"CAD\",$F316*((Settings!$B$2)+1),$F316*$E$9*((Settings!$B$2)+1)), IF($E316=\"USD\",$F316*((Settings!$B$2)+1),$F316*$E$9*((Settings!$B$2)+1))),””),\"\")","v":""},{"$f":"IFERROR(IF($F316>0,$AA316*(1-Settings!$B$3),\"\"),\"\")","v":""},"",null,null,null,null,"","","",0,"",0,0,{"$f":"IF($C316<>\"\",GetStockNumParam($C316,\"h\"),\"\")","v":""},0,"",""]
["",null,null,null,null,null,null,null,null,null,null,"","","","","",{"$f":"IFERROR(IF($F317>0,IF($B$6=\"Canada\",IF($E317=\"CAD\",$F317*((Settings!$B$2)+1),$F317*$E$9*((Settings!$B$2)+1)), IF($E317=\"USD\",$F317*((Settings!$B$2)+1),$F317*$E$9*((Settings!$B$2)+1))),””),\"\")","v":""},{"$f":"IFERROR(IF($F317>0,$AA317*(1-Settings!$B$3),\"\"),\"\")","v":""},"",null,null,null,null,"","","",0,"",0,0,{"$f":"IF($C317<>\"\",GetStockNumParam($C317,\"h\"),\"\")","v":""},0,"",""]
["",null,null,null,null,null,null,null,null,null,null,"","","","","",{"$f":"IFERROR(IF($F318>0,IF($B$6=\"Canada\",IF($E318=\"CAD\",$F318*((Settings!$B$2)+1),$F318*$E$9*((Settings!$B$2)+1)), IF($E318=\"USD\",$F318*((Settings!$B$2)+1),$F318*$E$9*((Settings!$B$2)+1))),””),\"\")","v":""},{"$f":"IFERROR(IF($F318>0,$AA318*(1-Settings!$B$3),\"\"),\"\")","v":""},"",null,null,null,null,"","","",0,"",0,0,{"$f":"IF($C318<>\"\",GetStockNumParam($C318,\"h\"),\"\")","v":""},0,"",""]
["",null,null,null,null,null,null,null,null,null,null,"","","","","",{"$f":"IFERROR(IF($F319>0,IF($B$6=\"Canada\",IF($E319=\"CAD\",$F319*((Settings!$B$2)+1),$F319*$E$9*((Settings!$B$2)+1)), IF($E319=\"USD\",$F319*((Settings!$B$2)+1),$F319*$E$9*((Settings!$B$2)+1))),””),\"\")","v":""},{"$f":"IFERROR(IF($F319>0,$AA319*(1-Settings!$B$3),\"\"),\"\")","v":""},"",null,null,null,null,"","","",0,"",0,0,{"$f":"IF($C319<>\"\",GetStockNumParam($C319,\"h\"),\"\")","v":""},0,"",""]
["",null,null,null,null,null,null,null,null,null,null,"","","","","",{"$f":"IFERROR(IF($F320>0,IF($B$6=\"Canada\",IF($E320=\"CAD\",$F320*((Settings!$B$2)+1),$F320*$E$9*((Settings!$B$2)+1)), IF($E320=\"USD\",$F320*((Settings!$B$2)+1),$F320*$E$9*((Settings!$B$2)+1))),””),\"\")","v":""},{"$f":"IFERROR(IF($F320>0,$AA320*(1-Settings!$B$3),\"\"),\"\")","v":""},"",null,null,null,null,"","","",0,"",0,0,{"$f":"IF($C320<>\"\",GetStockNumParam($C320,\"h\"),\"\")","v":""},0,"",""]
["",null,null,null,null,null,null,null,null,null,null,"","","","","",{"$f":"IFERROR(IF($F321>0,IF($B$6=\"Canada\",IF($E321=\"CAD\",$F321*((Settings!$B$2)+1),$F321*$E$9*((Settings!$B$2)+1)), IF($E321=\"USD\",$F321*((Settings!$B$2)+1),$F321*$E$9*((Settings!$B$2)+1))),””),\"\")","v":""},{"$f":"IFERROR(IF($F321>0,$AA321*(1-Settings!$B$3),\"\"),\"\")","v":""},"",null,null,null,null,"","","",0,"",0,0,{"$f":"IF($C321<>\"\",GetStockNumParam($C321,\"h\"),\"\")","v":""},0,"",""]
["",null,null,null,null,null,null,null,null,null,null,"","","","","",{"$f":"IFERROR(IF($F322>0,IF($B$6=\"Canada\",IF($E322=\"CAD\",$F322*((Settings!$B$2)+1),$F322*$E$9*((Settings!$B$2)+1)), IF($E322=\"USD\",$F322*((Settings!$B$2)+1),$F322*$E$9*((Settings!$B$2)+1))),””),\"\")","v":""},{"$f":"IFERROR(IF($F322>0,$AA322*(1-Settings!$B$3),\"\"),\"\")","v":""},"",null,null,null,null,"","","",0,"",0,0,{"$f":"IF($C322<>\"\",GetStockNumParam($C322,\"h\"),\"\")","v":""},0,"",""]
["",null,null,null,null,null,null,null,null,null,null,"","","","","",{"$f":"IFERROR(IF($F323>0,IF($B$6=\"Canada\",IF($E323=\"CAD\",$F323*((Settings!$B$2)+1),$F323*$E$9*((Settings!$B$2)+1)), IF($E323=\"USD\",$F323*((Settings!$B$2)+1),$F323*$E$9*((Settings!$B$2)+1))),””),\"\")","v":""},{"$f":"IFERROR(IF($F323>0,$AA323*(1-Settings!$B$3),\"\"),\"\")","v":""},"",null,null,null,null,"","","",0,"",0,0,{"$f":"IF($C323<>\"\",GetStockNumParam($C323,\"h\"),\"\")","v":""},0,"",""]
["",null,null,null,null,null,null,null,null,null,null,"","","","","",{"$f":"IFERROR(IF($F324>0,IF($B$6=\"Canada\",IF($E324=\"CAD\",$F324*((Settings!$B$2)+1),$F324*$E$9*((Settings!$B$2)+1)), IF($E324=\"USD\",$F324*((Settings!$B$2)+1),$F324*$E$9*((Settings!$B$2)+1))),””),\"\")","v":""},{"$f":"IFERROR(IF($F324>0,$AA324*(1-Settings!$B$3),\"\"),\"\")","v":""},"",null,null,null,null,"","","",0,"",0,0,{"$f":"IF($C324<>\"\",GetStockNumParam($C324,\"h\"),\"\")","v":""},0,"",""]
["",null,null,null,null,null,null,null,null,null,null,"","","","","",{"$f":"IFERROR(IF($F325>0,IF($B$6=\"Canada\",IF($E325=\"CAD\",$F325*((Settings!$B$2)+1),$F325*$E$9*((Settings!$B$2)+1)), IF($E325=\"USD\",$F325*((Settings!$B$2)+1),$F325*$E$9*((Settings!$B$2)+1))),””),\"\")","v":""},{"$f":"IFERROR(IF($F325>0,$AA325*(1-Settings!$B$3),\"\"),\"\")","v":""},"",null,null,null,null,"","","",0,"",0,0,{"$f":"IF($C325<>\"\",GetStockNumParam($C325,\"h\"),\"\")","v":""},0,"",""]
["",null,null,null,null,null,null,null,null,null,null,"","","","","",{"$f":"IFERROR(IF($F326>0,IF($B$6=\"Canada\",IF($E326=\"CAD\",$F326*((Settings!$B$2)+1),$F326*$E$9*((Settings!$B$2)+1)), IF($E326=\"USD\",$F326*((Settings!$B$2)+1),$F326*$E$9*((Settings!$B$2)+1))),””),\"\")","v":""},{"$f":"IFERROR(IF($F326>0,$AA326*(1-Settings!$B$3),\"\"),\"\")","v":""},"",null,null,null,null,"","","",0,"",0,0,{"$f":"IF($C326<>\"\",GetStockNumParam($C326,\"h\"),\"\")","v":""},0,"",""]
["",null,null,null,null,null,null,null,null,null,null,"","","","","",{"$f":"IFERROR(IF($F327>0,IF($B$6=\"Canada\",IF($E327=\"CAD\",$F327*((Settings!$B$2)+1),$F327*$E$9*((Settings!$B$2)+1)), IF($E327=\"USD\",$F327*((Settings!$B$2)+1),$F327*$E$9*((Settings!$B$2)+1))),””),\"\")","v":""},{"$f":"IFERROR(IF($F327>0,$AA327*(1-Settings!$B$3),\"\"),\"\")","v":""},"",null,null,null,null,"","","",0,"",0,0,{"$f":"IF($C327<>\"\",GetStockNumParam($C327,\"h\"),\"\")","v":""},0,"",""]
["",null,null,null,null,null,null,null,null,null,null,"","","","","",{"$f":"IFERROR(IF($F328>0,IF($B$6=\"Canada\",IF($E328=\"CAD\",$F328*((Settings!$B$2)+1),$F328*$E$9*((Settings!$B$2)+1)), IF($E328=\"USD\",$F328*((Settings!$B$2)+1),$F328*$E$9*((Settings!$B$2)+1))),””),\"\")","v":""},{"$f":"IFERROR(IF($F328>0,$AA328*(1-Settings!$B$3),\"\"),\"\")","v":""},"",null,null,null,null,"","","",0,"",0,0,{"$f":"IF($C328<>\"\",GetStockNumParam($C328,\"h\"),\"\")","v":""},0,"",""]
["",null,null,null,null,null,null,null,null,null,null,"","","","","",{"$f":"IFERROR(IF($F329>0,IF($B$6=\"Canada\",IF($E329=\"CAD\",$F329*((Settings!$B$2)+1),$F329*$E$9*((Settings!$B$2)+1)), IF($E329=\"USD\",$F329*((Settings!$B$2)+1),$F329*$E$9*((Settings!$B$2)+1))),””),\"\")","v":""},{"$f":"IFERROR(IF($F329>0,$AA329*(1-Settings!$B$3),\"\"),\"\")","v":""},"",null,null,null,null,"","","",0,"",0,0,{"$f":"IF($C329<>\"\",GetStockNumParam($C329,\"h\"),\"\")","v":""},0,"",""]
["",null,null,null,null,null,null,null,null,null,null,"","","","","",{"$f":"IFERROR(IF($F330>0,IF($B$6=\"Canada\",IF($E330=\"CAD\",$F330*((Settings!$B$2)+1),$F330*$E$9*((Settings!$B$2)+1)), IF($E330=\"USD\",$F330*((Settings!$B$2)+1),$F330*$E$9*((Settings!$B$2)+1))),””),\"\")","v":""},{"$f":"IFERROR(IF($F330>0,$AA330*(1-Settings!$B$3),\"\"),\"\")","v":""},"",null,null,null,null,"","","",0,"",0,0,{"$f":"IF($C330<>\"\",GetStockNumParam($C330,\"h\"),\"\")","v":""},0,"",""]
["",null,null,null,null,null,null,null,null,null,null,"","","","","",{"$f":"IFERROR(IF($F331>0,IF($B$6=\"Canada\",IF($E331=\"CAD\",$F331*((Settings!$B$2)+1),$F331*$E$9*((Settings!$B$2)+1)), IF($E331=\"USD\",$F331*((Settings!$B$2)+1),$F331*$E$9*((Settings!$B$2)+1))),””),\"\")","v":""},{"$f":"IFERROR(IF($F331>0,$AA331*(1-Settings!$B$3),\"\"),\"\")","v":""},"",null,null,null,null,"","","",0,"",0,0,{"$f":"IF($C331<>\"\",GetStockNumParam($C331,\"h\"),\"\")","v":""},0,"",""]
[{"$f":"IF($C332=\"\",\"\",GetName($C332))","v":""},null,null,null,null,null,null,null,null,null,null,"","","","","",{"$f":"IFERROR(IF($F332>0,IF($B$6=\"Canada\",IF($E332=\"CAD\",$F332*((Settings!$B$2)+1),$F332*$E$9*((Settings!$B$2)+1)), IF($E332=\"USD\",$F332*((Settings!$B$2)+1),$F332*$E$9*((Settings!$B$2)+1))),””),\"\")","v":""},{"$f":"IFERROR(IF($F332>0,$AA332*(1-Settings!$B$3),\"\"),\"\")","v":""},"",null,null,null,null,"","","",{"$f":"IF($B$6=\"Canada\",\nIF($E332=\"CAD\",IF($F332>$K332,$F332,$K332),IF(($F332*$E$9)>$K332,($F332*$E$9),$K332)),\nIF($E332=\"CAD\",IF(($F332*$E$9)>$K332,($F332*$E$9),$K332),IF($F332>$K332,$F332,$K332)))","v":0},{"$f":"IF($B332=\"Simulate\",0,IF(N332 = \"SOLD\", 0, N332))","v":""},{"$f":"IF($B332=\"Simulate\",0,IF(N332 = \"SOLD\",0,I332))","v":0},0,{"$f":"IF($C332<>\"\",GetStockNumParam($C332,\"h\"),\"\")","v":""},{"$f":"IF($B332=\"Simulate\",0,$I332)","v":0},{"$f":"IF($B332=\"Simulate\",0,Z332)","v":""},{"$f":"IF($B332=\"Simulate\",\"\",$O332)","v":""}]
["",null,null,null,null,null,null,null,null,null,null,"","","","","",{"$f":"IFERROR(IF($F333>0,IF($B$6=\"Canada\",IF($E333=\"CAD\",$F333*((Settings!$B$2)+1),$F333*$E$9*((Settings!$B$2)+1)), IF($E333=\"USD\",$F333*((Settings!$B$2)+1),$F333*$E$9*((Settings!$B$2)+1))),””),\"\")","v":""},{"$f":"IFERROR(IF($F333>0,$AA333*(1-Settings!$B$3),\"\"),\"\")","v":""},"",null,null,null,null,"","","",0,"",0,0,{"$f":"IF($C333<>\"\",GetStockNumParam($C333,\"h\"),\"\")","v":""},0,"",""]
["",null,null,null,null,null,null,null,null,null,null,"","","","","",{"$f":"IFERROR(IF($F334>0,IF($B$6=\"Canada\",IF($E334=\"CAD\",$F334*((Settings!$B$2)+1),$F334*$E$9*((Settings!$B$2)+1)), IF($E334=\"USD\",$F334*((Settings!$B$2)+1),$F334*$E$9*((Settings!$B$2)+1))),””),\"\")","v":""},{"$f":"IFERROR(IF($F334>0,$AA334*(1-Settings!$B$3),\"\"),\"\")","v":""},"",null,null,null,null,"","","",0,"",0,0,{"$f":"IF($C334<>\"\",GetStockNumParam($C334,\"h\"),\"\")","v":""},0,"",""]
["",null,null,null,null,null,null,null,null,null,null,"","","","","",{"$f":"IFERROR(IF($F335>0,IF($B$6=\"Canada\",IF($E335=\"CAD\",$F335*((Settings!$B$2)+1),$F335*$E$9*((Settings!$B$2)+1)), IF($E335=\"USD\",$F335*((Settings!$B$2)+1),$F335*$E$9*((Settings!$B$2)+1))),””),\"\")","v":""},{"$f":"IFERROR(IF($F335>0,$AA335*(1-Settings!$B$3),\"\"),\"\")","v":""},"",null,null,null,null,"","","",0,"",0,0,{"$f":"IF($C335<>\"\",GetStockNumParam($C335,\"h\"),\"\")","v":""},0,"",""]
["",null,null,null,null,null,null,null,null,null,null,"","","","","",{"$f":"IFERROR(IF($F336>0,IF($B$6=\"Canada\",IF($E336=\"CAD\",$F336*((Settings!$B$2)+1),$F336*$E$9*((Settings!$B$2)+1)), IF($E336=\"USD\",$F336*((Settings!$B$2)+1),$F336*$E$9*((Settings!$B$2)+1))),””),\"\")","v":""},{"$f":"IFERROR(IF($F336>0,$AA336*(1-Settings!$B$3),\"\"),\"\")","v":""},"",null,null,null,null,"","","",0,"",0,0,{"$f":"IF($C336<>\"\",GetStockNumParam($C336,\"h\"),\"\")","v":""},0,"",""]
["",null,null,null,null,null,null,null,null,null,null,"","","","","",{"$f":"IFERROR(IF($F337>0,IF($B$6=\"Canada\",IF($E337=\"CAD\",$F337*((Settings!$B$2)+1),$F337*$E$9*((Settings!$B$2)+1)), IF($E337=\"USD\",$F337*((Settings!$B$2)+1),$F337*$E$9*((Settings!$B$2)+1))),””),\"\")","v":""},{"$f":"IFERROR(IF($F337>0,$AA337*(1-Settings!$B$3),\"\"),\"\")","v":""},"",null,null,null,null,"","","",0,"",0,0,{"$f":"IF($C337<>\"\",GetStockNumParam($C337,\"h\"),\"\")","v":""},0,"",""]
["",null,null,null,null,null,null,null,null,null,null,"","","","","",{"$f":"IFERROR(IF($F338>0,IF($B$6=\"Canada\",IF($E338=\"CAD\",$F338*((Settings!$B$2)+1),$F338*$E$9*((Settings!$B$2)+1)), IF($E338=\"USD\",$F338*((Settings!$B$2)+1),$F338*$E$9*((Settings!$B$2)+1))),””),\"\")","v":""},{"$f":"IFERROR(IF($F338>0,$AA338*(1-Settings!$B$3),\"\"),\"\")","v":""},"",null,null,null,null,"","","",0,"",0,0,{"$f":"IF($C338<>\"\",GetStockNumParam($C338,\"h\"),\"\")","v":""},0,"",""]
["",null,null,null,null,null,null,null,null,null,null,"","","","","",{"$f":"IFERROR(IF($F339>0,IF($B$6=\"Canada\",IF($E339=\"CAD\",$F339*((Settings!$B$2)+1),$F339*$E$9*((Settings!$B$2)+1)), IF($E339=\"USD\",$F339*((Settings!$B$2)+1),$F339*$E$9*((Settings!$B$2)+1))),””),\"\")","v":""},{"$f":"IFERROR(IF($F339>0,$AA339*(1-Settings!$B$3),\"\"),\"\")","v":""},"",null,null,null,null,"","","",0,"",0,0,{"$f":"IF($C339<>\"\",GetStockNumParam($C339,\"h\"),\"\")","v":""},0,"",""]
["",null,null,null,null,null,null,null,null,null,null,"","","","","",{"$f":"IFERROR(IF($F340>0,IF($B$6=\"Canada\",IF($E340=\"CAD\",$F340*((Settings!$B$2)+1),$F340*$E$9*((Settings!$B$2)+1)), IF($E340=\"USD\",$F340*((Settings!$B$2)+1),$F340*$E$9*((Settings!$B$2)+1))),””),\"\")","v":""},{"$f":"IFERROR(IF($F340>0,$AA340*(1-Settings!$B$3),\"\"),\"\")","v":""},"",null,null,null,null,"","","",0,"",0,0,{"$f":"IF($C340<>\"\",GetStockNumParam($C340,\"h\"),\"\")","v":""},0,"",""]
["",null,null,null,null,null,null,null,null,null,null,"","","","","",{"$f":"IFERROR(IF($F341>0,IF($B$6=\"Canada\",IF($E341=\"CAD\",$F341*((Settings!$B$2)+1),$F341*$E$9*((Settings!$B$2)+1)), IF($E341=\"USD\",$F341*((Settings!$B$2)+1),$F341*$E$9*((Settings!$B$2)+1))),””),\"\")","v":""},{"$f":"IFERROR(IF($F341>0,$AA341*(1-Settings!$B$3),\"\"),\"\")","v":""},"",null,null,null,null,"","","",0,"",0,0,{"$f":"IF($C341<>\"\",GetStockNumParam($C341,\"h\"),\"\")","v":""},0,"",""]
["",null,null,null,null,null,null,null,null,null,null,"","","","","",{"$f":"IFERROR(IF($F342>0,IF($B$6=\"Canada\",IF($E342=\"CAD\",$F342*((Settings!$B$2)+1),$F342*$E$9*((Settings!$B$2)+1)), IF($E342=\"USD\",$F342*((Settings!$B$2)+1),$F342*$E$9*((Settings!$B$2)+1))),””),\"\")","v":""},{"$f":"IFERROR(IF($F342>0,$AA342*(1-Settings!$B$3),\"\"),\"\")","v":""},"",null,null,null,null,"","","",0,"",0,0,{"$f":"IF($C342<>\"\",GetStockNumParam($C342,\"h\"),\"\")","v":""},0,"",""]
["",null,null,null,null,null,null,null,null,null,null,"","","","","",{"$f":"IFERROR(IF($F343>0,IF($B$6=\"Canada\",IF($E343=\"CAD\",$F343*((Settings!$B$2)+1),$F343*$E$9*((Settings!$B$2)+1)), IF($E343=\"USD\",$F343*((Settings!$B$2)+1),$F343*$E$9*((Settings!$B$2)+1))),””),\"\")","v":""},{"$f":"IFERROR(IF($F343>0,$AA343*(1-Settings!$B$3),\"\"),\"\")","v":""},"",null,null,null,null,"","","",0,"",0,0,{"$f":"IF($C343<>\"\",GetStockNumParam($C343,\"h\"),\"\")","v":""},0,"",""]
["",null,null,null,null,null,null,null,null,null,null,"","","","","",{"$f":"IFERROR(IF($F344>0,IF($B$6=\"Canada\",IF($E344=\"CAD\",$F344*((Settings!$B$2)+1),$F344*$E$9*((Settings!$B$2)+1)), IF($E344=\"USD\",$F344*((Settings!$B$2)+1),$F344*$E$9*((Settings!$B$2)+1))),””),\"\")","v":""},{"$f":"IFERROR(IF($F344>0,$AA344*(1-Settings!$B$3),\"\"),\"\")","v":""},"",null,null,null,null,"","","",0,"",0,0,{"$f":"IF($C344<>\"\",GetStockNumParam($C344,\"h\"),\"\")","v":""},0,"",""]
["",null,null,null,null,null,null,null,null,null,null,"","","","","",{"$f":"IFERROR(IF($F345>0,IF($B$6=\"Canada\",IF($E345=\"CAD\",$F345*((Settings!$B$2)+1),$F345*$E$9*((Settings!$B$2)+1)), IF($E345=\"USD\",$F345*((Settings!$B$2)+1),$F345*$E$9*((Settings!$B$2)+1))),””),\"\")","v":""},{"$f":"IFERROR(IF($F345>0,$AA345*(1-Settings!$B$3),\"\"),\"\")","v":""},"",null,null,null,null,"","","",0,"",0,0,{"$f":"IF($C345<>\"\",GetStockNumParam($C345,\"h\"),\"\")","v":""},0,"",""]
["",null,null,null,null,null,null,null,null,null,null,"","","","","",{"$f":"IFERROR(IF($F346>0,IF($B$6=\"Canada\",IF($E346=\"CAD\",$F346*((Settings!$B$2)+1),$F346*$E$9*((Settings!$B$2)+1)), IF($E346=\"USD\",$F346*((Settings!$B$2)+1),$F346*$E$9*((Settings!$B$2)+1))),””),\"\")","v":""},{"$f":"IFERROR(IF($F346>0,$AA346*(1-Settings!$B$3),\"\"),\"\")","v":""},"",null,null,null,null,"","","",0,"",0,0,{"$f":"IF($C346<>\"\",GetStockNumParam($C346,\"h\"),\"\")","v":""},0,"",""]
["",null,null,null,null,null,null,null,null,null,null,"","","","","",{"$f":"IFERROR(IF($F347>0,IF($B$6=\"Canada\",IF($E347=\"CAD\",$F347*((Settings!$B$2)+1),$F347*$E$9*((Settings!$B$2)+1)), IF($E347=\"USD\",$F347*((Settings!$B$2)+1),$F347*$E$9*((Settings!$B$2)+1))),””),\"\")","v":""},{"$f":"IFERROR(IF($F347>0,$AA347*(1-Settings!$B$3),\"\"),\"\")","v":""},"",null,null,null,null,"","","",0,"",0,0,{"$f":"IF($C347<>\"\",GetStockNumParam($C347,\"h\"),\"\")","v":""},0,"",""]
["",null,null,null,null,null,null,null,null,null,null,"","","","","",{"$f":"IFERROR(IF($F348>0,IF($B$6=\"Canada\",IF($E348=\"CAD\",$F348*((Settings!$B$2)+1),$F348*$E$9*((Settings!$B$2)+1)), IF($E348=\"USD\",$F348*((Settings!$B$2)+1),$F348*$E$9*((Settings!$B$2)+1))),””),\"\")","v":""},{"$f":"IFERROR(IF($F348>0,$AA348*(1-Settings!$B$3),\"\"),\"\")","v":""},"",null,null,null,null,"","","",0,"",0,0,{"$f":"IF($C348<>\"\",GetStockNumParam($C348,\"h\"),\"\")","v":""},0,"",""]
["",null,null,null,null,null,null,null,null,null,null,"","","","","",{"$f":"IFERROR(IF($F349>0,IF($B$6=\"Canada\",IF($E349=\"CAD\",$F349*((Settings!$B$2)+1),$F349*$E$9*((Settings!$B$2)+1)), IF($E349=\"USD\",$F349*((Settings!$B$2)+1),$F349*$E$9*((Settings!$B$2)+1))),””),\"\")","v":""},{"$f":"IFERROR(IF($F349>0,$AA349*(1-Settings!$B$3),\"\"),\"\")","v":""},"",null,null,null,null,"","","",0,"",0,0,{"$f":"IF($C349<>\"\",GetStockNumParam($C349,\"h\"),\"\")","v":""},0,"",""]
["",null,null,null,null,null,null,null,null,null,null,"","","","","",{"$f":"IFERROR(IF($F350>0,IF($B$6=\"Canada\",IF($E350=\"CAD\",$F350*((Settings!$B$2)+1),$F350*$E$9*((Settings!$B$2)+1)), IF($E350=\"USD\",$F350*((Settings!$B$2)+1),$F350*$E$9*((Settings!$B$2)+1))),””),\"\")","v":""},{"$f":"IFERROR(IF($F350>0,$AA350*(1-Settings!$B$3),\"\"),\"\")","v":""},"",null,null,null,null,"","","",0,"",0,0,{"$f":"IF($C350<>\"\",GetStockNumParam($C350,\"h\"),\"\")","v":""},0,"",""]
["",null,null,null,null,null,null,null,null,null,null,"","","","","",{"$f":"IFERROR(IF($F351>0,IF($B$6=\"Canada\",IF($E351=\"CAD\",$F351*((Settings!$B$2)+1),$F351*$E$9*((Settings!$B$2)+1)), IF($E351=\"USD\",$F351*((Settings!$B$2)+1),$F351*$E$9*((Settings!$B$2)+1))),””),\"\")","v":""},{"$f":"IFERROR(IF($F351>0,$AA351*(1-Settings!$B$3),\"\"),\"\")","v":""},"",null,null,null,null,"","","",0,"",0,0,{"$f":"IF($C351<>\"\",GetStockNumParam($C351,\"h\"),\"\")","v":""},0,"",""]
["",null,null,null,null,null,null,null,null,null,null,"","","","","",{"$f":"IFERROR(IF($F352>0,IF($B$6=\"Canada\",IF($E352=\"CAD\",$F352*((Settings!$B$2)+1),$F352*$E$9*((Settings!$B$2)+1)), IF($E352=\"USD\",$F352*((Settings!$B$2)+1),$F352*$E$9*((Settings!$B$2)+1))),””),\"\")","v":""},{"$f":"IFERROR(IF($F352>0,$AA352*(1-Settings!$B$3),\"\"),\"\")","v":""},"",null,null,null,null,"","","",0,"",0,0,{"$f":"IF($C352<>\"\",GetStockNumParam($C352,\"h\"),\"\")","v":""},0,"",""]
["",null,null,null,null,null,null,null,null,null,null,"","","","","",{"$f":"IFERROR(IF($F353>0,IF($B$6=\"Canada\",IF($E353=\"CAD\",$F353*((Settings!$B$2)+1),$F353*$E$9*((Settings!$B$2)+1)), IF($E353=\"USD\",$F353*((Settings!$B$2)+1),$F353*$E$9*((Settings!$B$2)+1))),””),\"\")","v":""},{"$f":"IFERROR(IF($F353>0,$AA353*(1-Settings!$B$3),\"\"),\"\")","v":""},"",null,null,null,null,"","","",0,"",0,0,{"$f":"IF($C353<>\"\",GetStockNumParam($C353,\"h\"),\"\")","v":""},0,"",""]
["",null,null,null,null,null,null,null,null,null,null,"","","","","",{"$f":"IFERROR(IF($F354>0,IF($B$6=\"Canada\",IF($E354=\"CAD\",$F354*((Settings!$B$2)+1),$F354*$E$9*((Settings!$B$2)+1)), IF($E354=\"USD\",$F354*((Settings!$B$2)+1),$F354*$E$9*((Settings!$B$2)+1))),””),\"\")","v":""},{"$f":"IFERROR(IF($F354>0,$AA354*(1-Settings!$B$3),\"\"),\"\")","v":""},"",null,null,null,null,"","","",0,"",0,0,{"$f":"IF($C354<>\"\",GetStockNumParam($C354,\"h\"),\"\")","v":""},0,"",""]
["",null,null,null,null,null,null,null,null,null,null,"","","","","",{"$f":"IFERROR(IF($F355>0,IF($B$6=\"Canada\",IF($E355=\"CAD\",$F355*((Settings!$B$2)+1),$F355*$E$9*((Settings!$B$2)+1)), IF($E355=\"USD\",$F355*((Settings!$B$2)+1),$F355*$E$9*((Settings!$B$2)+1))),””),\"\")","v":""},{"$f":"IFERROR(IF($F355>0,$AA355*(1-Settings!$B$3),\"\"),\"\")","v":""},"",null,null,null,null,"","","",0,"",0,0,{"$f":"IF($C355<>\"\",GetStockNumParam($C355,\"h\"),\"\")","v":""},0,"",""]
["",null,null,null,null,null,null,null,null,null,null,"","","","","",{"$f":"IFERROR(IF($F356>0,IF($B$6=\"Canada\",IF($E356=\"CAD\",$F356*((Settings!$B$2)+1),$F356*$E$9*((Settings!$B$2)+1)), IF($E356=\"USD\",$F356*((Settings!$B$2)+1),$F356*$E$9*((Settings!$B$2)+1))),””),\"\")","v":""},{"$f":"IFERROR(IF($F356>0,$AA356*(1-Settings!$B$3),\"\"),\"\")","v":""},"",null,null,null,null,"","","",0,"",0,0,{"$f":"IF($C356<>\"\",GetStockNumParam($C356,\"h\"),\"\")","v":""},0,"",""]
["",null,null,null,null,null,null,null,null,null,null,"","","","","",{"$f":"IFERROR(IF($F357>0,IF($B$6=\"Canada\",IF($E357=\"CAD\",$F357*((Settings!$B$2)+1),$F357*$E$9*((Settings!$B$2)+1)), IF($E357=\"USD\",$F357*((Settings!$B$2)+1),$F357*$E$9*((Settings!$B$2)+1))),””),\"\")","v":""},{"$f":"IFERROR(IF($F357>0,$AA357*(1-Settings!$B$3),\"\"),\"\")","v":""},"",null,null,null,null,"","","",0,"",0,0,{"$f":"IF($C357<>\"\",GetStockNumParam($C357,\"h\"),\"\")","v":""},0,"",""]
["",null,null,null,null,null,null,null,null,null,null,"","","","","",{"$f":"IFERROR(IF($F358>0,IF($B$6=\"Canada\",IF($E358=\"CAD\",$F358*((Settings!$B$2)+1),$F358*$E$9*((Settings!$B$2)+1)), IF($E358=\"USD\",$F358*((Settings!$B$2)+1),$F358*$E$9*((Settings!$B$2)+1))),””),\"\")","v":""},{"$f":"IFERROR(IF($F358>0,$AA358*(1-Settings!$B$3),\"\"),\"\")","v":""},"",null,null,null,null,"","","",0,"",0,0,{"$f":"IF($C358<>\"\",GetStockNumParam($C358,\"h\"),\"\")","v":""},0,"",""]
["",null,null,null,null,null,null,null,null,null,null,"","","","","",{"$f":"IFERROR(IF($F359>0,IF($B$6=\"Canada\",IF($E359=\"CAD\",$F359*((Settings!$B$2)+1),$F359*$E$9*((Settings!$B$2)+1)), IF($E359=\"USD\",$F359*((Settings!$B$2)+1),$F359*$E$9*((Settings!$B$2)+1))),””),\"\")","v":""},{"$f":"IFERROR(IF($F359>0,$AA359*(1-Settings!$B$3),\"\"),\"\")","v":""},"",null,null,null,null,"","","",0,"",0,0,{"$f":"IF($C359<>\"\",GetStockNumParam($C359,\"h\"),\"\")","v":""},0,"",""]
["",null,null,null,null,null,null,null,null,null,null,"","","","","",{"$f":"IFERROR(IF($F360>0,IF($B$6=\"Canada\",IF($E360=\"CAD\",$F360*((Settings!$B$2)+1),$F360*$E$9*((Settings!$B$2)+1)), IF($E360=\"USD\",$F360*((Settings!$B$2)+1),$F360*$E$9*((Settings!$B$2)+1))),””),\"\")","v":""},{"$f":"IFERROR(IF($F360>0,$AA360*(1-Settings!$B$3),\"\"),\"\")","v":""},"",null,null,null,null,"","","",0,"",0,0,{"$f":"IF($C360<>\"\",GetStockNumParam($C360,\"h\"),\"\")","v":""},0,"",""]
["",null,null,null,null,null,null,null,null,null,null,"","","","","",{"$f":"IFERROR(IF($F361>0,IF($B$6=\"Canada\",IF($E361=\"CAD\",$F361*((Settings!$B$2)+1),$F361*$E$9*((Settings!$B$2)+1)), IF($E361=\"USD\",$F361*((Settings!$B$2)+1),$F361*$E$9*((Settings!$B$2)+1))),””),\"\")","v":""},{"$f":"IFERROR(IF($F361>0,$AA361*(1-Settings!$B$3),\"\"),\"\")","v":""},"",null,null,null,null,"","","",0,"",0,0,{"$f":"IF($C361<>\"\",GetStockNumParam($C361,\"h\"),\"\")","v":""},0,"",""]
["",null,null,null,null,null,null,null,null,null,null,"","","","","",{"$f":"IFERROR(IF($F362>0,IF($B$6=\"Canada\",IF($E362=\"CAD\",$F362*((Settings!$B$2)+1),$F362*$E$9*((Settings!$B$2)+1)), IF($E362=\"USD\",$F362*((Settings!$B$2)+1),$F362*$E$9*((Settings!$B$2)+1))),””),\"\")","v":""},{"$f":"IFERROR(IF($F362>0,$AA362*(1-Settings!$B$3),\"\"),\"\")","v":""},"",null,null,null,null,"","","",0,"",0,0,{"$f":"IF($C362<>\"\",GetStockNumParam($C362,\"h\"),\"\")","v":""},0,"",""]
["",null,null,null,null,null,null,null,null,null,null,"","","","","",{"$f":"IFERROR(IF($F363>0,IF($B$6=\"Canada\",IF($E363=\"CAD\",$F363*((Settings!$B$2)+1),$F363*$E$9*((Settings!$B$2)+1)), IF($E363=\"USD\",$F363*((Settings!$B$2)+1),$F363*$E$9*((Settings!$B$2)+1))),””),\"\")","v":""},{"$f":"IFERROR(IF($F363>0,$AA363*(1-Settings!$B$3),\"\"),\"\")","v":""},"",null,null,null,null,"","","",0,"",0,0,{"$f":"IF($C363<>\"\",GetStockNumParam($C363,\"h\"),\"\")","v":""},0,"",""]
["",null,null,null,null,null,null,null,null,null,null,"","","","","",{"$f":"IFERROR(IF($F364>0,IF($B$6=\"Canada\",IF($E364=\"CAD\",$F364*((Settings!$B$2)+1),$F364*$E$9*((Settings!$B$2)+1)), IF($E364=\"USD\",$F364*((Settings!$B$2)+1),$F364*$E$9*((Settings!$B$2)+1))),””),\"\")","v":""},{"$f":"IFERROR(IF($F364>0,$AA364*(1-Settings!$B$3),\"\"),\"\")","v":""},"",null,null,null,null,"","","",0,"",0,0,{"$f":"IF($C364<>\"\",GetStockNumParam($C364,\"h\"),\"\")","v":""},0,"",""]
["",null,null,null,null,null,null,null,null,null,null,"","","","","",{"$f":"IFERROR(IF($F365>0,IF($B$6=\"Canada\",IF($E365=\"CAD\",$F365*((Settings!$B$2)+1),$F365*$E$9*((Settings!$B$2)+1)), IF($E365=\"USD\",$F365*((Settings!$B$2)+1),$F365*$E$9*((Settings!$B$2)+1))),””),\"\")","v":""},{"$f":"IFERROR(IF($F365>0,$AA365*(1-Settings!$B$3),\"\"),\"\")","v":""},"",null,null,null,null,"","","",0,"",0,0,{"$f":"IF($C365<>\"\",GetStockNumParam($C365,\"h\"),\"\")","v":""},0,"",""]
["",null,null,null,null,null,null,null,null,null,null,"","","","","",{"$f":"IFERROR(IF($F366>0,IF($B$6=\"Canada\",IF($E366=\"CAD\",$F366*((Settings!$B$2)+1),$F366*$E$9*((Settings!$B$2)+1)), IF($E366=\"USD\",$F366*((Settings!$B$2)+1),$F366*$E$9*((Settings!$B$2)+1))),””),\"\")","v":""},{"$f":"IFERROR(IF($F366>0,$AA366*(1-Settings!$B$3),\"\"),\"\")","v":""},"",null,null,null,null,"","","",0,"",0,0,{"$f":"IF($C366<>\"\",GetStockNumParam($C366,\"h\"),\"\")","v":""},0,"",""]
["",null,null,null,null,null,null,null,null,null,null,"","","","","",{"$f":"IFERROR(IF($F367>0,IF($B$6=\"Canada\",IF($E367=\"CAD\",$F367*((Settings!$B$2)+1),$F367*$E$9*((Settings!$B$2)+1)), IF($E367=\"USD\",$F367*((Settings!$B$2)+1),$F367*$E$9*((Settings!$B$2)+1))),””),\"\")","v":""},{"$f":"IFERROR(IF($F367>0,$AA367*(1-Settings!$B$3),\"\"),\"\")","v":""},"",null,null,null,null,"","","",0,"",0,0,{"$f":"IF($C367<>\"\",GetStockNumParam($C367,\"h\"),\"\")","v":""},0,"",""]
["",null,null,null,null,null,null,null,null,null,null,"","","","","",{"$f":"IFERROR(IF($F368>0,IF($B$6=\"Canada\",IF($E368=\"CAD\",$F368*((Settings!$B$2)+1),$F368*$E$9*((Settings!$B$2)+1)), IF($E368=\"USD\",$F368*((Settings!$B$2)+1),$F368*$E$9*((Settings!$B$2)+1))),””),\"\")","v":""},{"$f":"IFERROR(IF($F368>0,$AA368*(1-Settings!$B$3),\"\"),\"\")","v":""},"",null,null,null,null,"","","",0,"",0,0,{"$f":"IF($C368<>\"\",GetStockNumParam($C368,\"h\"),\"\")","v":""},0,"",""]
["",null,null,null,null,null,null,null,null,null,null,"","","","","",{"$f":"IFERROR(IF($F369>0,IF($B$6=\"Canada\",IF($E369=\"CAD\",$F369*((Settings!$B$2)+1),$F369*$E$9*((Settings!$B$2)+1)), IF($E369=\"USD\",$F369*((Settings!$B$2)+1),$F369*$E$9*((Settings!$B$2)+1))),””),\"\")","v":""},{"$f":"IFERROR(IF($F369>0,$AA369*(1-Settings!$B$3),\"\"),\"\")","v":""},"",null,null,null,null,"","","",0,"",0,0,{"$f":"IF($C369<>\"\",GetStockNumParam($C369,\"h\"),\"\")","v":""},0,"",""]
["",null,null,null,null,null,null,null,null,null,null,"","","","","",{"$f":"IFERROR(IF($F370>0,IF($B$6=\"Canada\",IF($E370=\"CAD\",$F370*((Settings!$B$2)+1),$F370*$E$9*((Settings!$B$2)+1)), IF($E370=\"USD\",$F370*((Settings!$B$2)+1),$F370*$E$9*((Settings!$B$2)+1))),””),\"\")","v":""},{"$f":"IFERROR(IF($F370>0,$AA370*(1-Settings!$B$3),\"\"),\"\")","v":""},"",null,null,null,null,"","","",0,"",0,0,{"$f":"IF($C370<>\"\",GetStockNumParam($C370,\"h\"),\"\")","v":""},0,"",""]
["",null,null,null,null,null,null,null,null,null,null,"","","","","",{"$f":"IFERROR(IF($F371>0,IF($B$6=\"Canada\",IF($E371=\"CAD\",$F371*((Settings!$B$2)+1),$F371*$E$9*((Settings!$B$2)+1)), IF($E371=\"USD\",$F371*((Settings!$B$2)+1),$F371*$E$9*((Settings!$B$2)+1))),””),\"\")","v":""},{"$f":"IFERROR(IF($F371>0,$AA371*(1-Settings!$B$3),\"\"),\"\")","v":""},"",null,null,null,null,"","","",0,"",0,0,{"$f":"IF($C371<>\"\",GetStockNumParam($C371,\"h\"),\"\")","v":""},0,"",""]
["",null,null,null,null,null,null,null,null,null,null,"","","","","",{"$f":"IFERROR(IF($F372>0,IF($B$6=\"Canada\",IF($E372=\"CAD\",$F372*((Settings!$B$2)+1),$F372*$E$9*((Settings!$B$2)+1)), IF($E372=\"USD\",$F372*((Settings!$B$2)+1),$F372*$E$9*((Settings!$B$2)+1))),””),\"\")","v":""},{"$f":"IFERROR(IF($F372>0,$AA372*(1-Settings!$B$3),\"\"),\"\")","v":""},"",null,null,null,null,"","","",0,"",0,0,{"$f":"IF($C372<>\"\",GetStockNumParam($C372,\"h\"),\"\")","v":""},0,"",""]
["",null,null,null,null,null,null,null,null,null,null,"","","","","",{"$f":"IFERROR(IF($F373>0,IF($B$6=\"Canada\",IF($E373=\"CAD\",$F373*((Settings!$B$2)+1),$F373*$E$9*((Settings!$B$2)+1)), IF($E373=\"USD\",$F373*((Settings!$B$2)+1),$F373*$E$9*((Settings!$B$2)+1))),””),\"\")","v":""},{"$f":"IFERROR(IF($F373>0,$AA373*(1-Settings!$B$3),\"\"),\"\")","v":""},"",null,null,null,null,"","","",0,"",0,0,{"$f":"IF($C373<>\"\",GetStockNumParam($C373,\"h\"),\"\")","v":""},0,"",""]
["",null,null,null,null,null,null,null,null,null,null,"","","","","",{"$f":"IFERROR(IF($F374>0,IF($B$6=\"Canada\",IF($E374=\"CAD\",$F374*((Settings!$B$2)+1),$F374*$E$9*((Settings!$B$2)+1)), IF($E374=\"USD\",$F374*((Settings!$B$2)+1),$F374*$E$9*((Settings!$B$2)+1))),””),\"\")","v":""},{"$f":"IFERROR(IF($F374>0,$AA374*(1-Settings!$B$3),\"\"),\"\")","v":""},"",null,null,null,null,"","","",0,"",0,0,{"$f":"IF($C374<>\"\",GetStockNumParam($C374,\"h\"),\"\")","v":""},0,"",""]
["",null,null,null,null,null,null,null,null,null,null,"","","","","",{"$f":"IFERROR(IF($F375>0,IF($B$6=\"Canada\",IF($E375=\"CAD\",$F375*((Settings!$B$2)+1),$F375*$E$9*((Settings!$B$2)+1)), IF($E375=\"USD\",$F375*((Settings!$B$2)+1),$F375*$E$9*((Settings!$B$2)+1))),””),\"\")","v":""},{"$f":"IFERROR(IF($F375>0,$AA375*(1-Settings!$B$3),\"\"),\"\")","v":""},"",null,null,null,null,"","","",0,"",0,0,{"$f":"IF($C375<>\"\",GetStockNumParam($C375,\"h\"),\"\")","v":""},0,"",""]
["",null,null,null,null,null,null,null,null,null,null,"","","","","",{"$f":"IFERROR(IF($F376>0,IF($B$6=\"Canada\",IF($E376=\"CAD\",$F376*((Settings!$B$2)+1),$F376*$E$9*((Settings!$B$2)+1)), IF($E376=\"USD\",$F376*((Settings!$B$2)+1),$F376*$E$9*((Settings!$B$2)+1))),””),\"\")","v":""},{"$f":"IFERROR(IF($F376>0,$AA376*(1-Settings!$B$3),\"\"),\"\")","v":""},"",null,null,null,null,"","","",0,"",0,0,{"$f":"IF($C376<>\"\",GetStockNumParam($C376,\"h\"),\"\")","v":""},0,"",""]
["",null,null,null,null,null,null,null,null,null,null,{"$f":"IF(J377 > 0,K377-J377,\"\")","v":""},{"$f":"IF(J377 > 0,(L377/J377),\"\")","v":""},{"$f":"IF(D377 > 0,IF(T377 > 0,\"SOLD\",D377*K377),\"\")","v":""},{"$f":"IF(D377 > 0,IF(T377 > 0, Z377-I377, N377-I377),\"\")","v":""},{"$f":"IF(D377 > 0,IF(O377=0,0,(O377/I377)),\"\")","v":""},{"$f":"IFERROR(IF($F377>0,IF($B$6=\"Canada\",IF($E377=\"CAD\",$F377*((Settings!$B$2)+1),$F377*$E$9*((Settings!$B$2)+1)), IF($E377=\"USD\",$F377*((Settings!$B$2)+1),$F377*$E$9*((Settings!$B$2)+1))),””),\"\")","v":""},{"$f":"IFERROR(IF($F377>0,$AA377*(1-Settings!$B$3),\"\"),\"\")","v":""},{"$f":"IF(F377>0,IF(K377>=Q377,\"SELL\",IF(K377<=R377,\"STOP\",\"HOLD\")),\"\")","v":""},null,null,null,null,{"$f":"IF(D377 > 0,IF(Z377 = 0,0,Z377-I377),\"\")","v":""},{"$f":"IF(D377 > 0,IF(Z377=0,0,(Z377/I377)-100%),\"\")","v":""},{"$f":"IF(T377 > 0,T377*D377-V377+W377,N377)","v":""},0,"",0,{"$f":"IF(N377 = \"SOLD\", Z377-I377,I377)","v":0},{"$f":"IF($C377<>\"\",GetStockNumParam($C377,\"h\"),\"\")","v":""},0,"",""]
["",null,null,null,null,null,null,null,null,null,null,"","","","","",{"$f":"IFERROR(IF($F378>0,IF($B$6=\"Canada\",IF($E378=\"CAD\",$F378*((Settings!$B$2)+1),$F378*$E$9*((Settings!$B$2)+1)), IF($E378=\"USD\",$F378*((Settings!$B$2)+1),$F378*$E$9*((Settings!$B$2)+1))),””),\"\")","v":""},{"$f":"IFERROR(IF($F378>0,$AA378*(1-Settings!$B$3),\"\"),\"\")","v":""},"",null,null,null,null,"","","",0,"",0,0,{"$f":"IF($C378<>\"\",GetStockNumParam($C378,\"h\"),\"\")","v":""},0,"",""]
["",null,null,null,null,null,null,null,null,null,null,"","","","","",{"$f":"IFERROR(IF($F379>0,IF($B$6=\"Canada\",IF($E379=\"CAD\",$F379*((Settings!$B$2)+1),$F379*$E$9*((Settings!$B$2)+1)), IF($E379=\"USD\",$F379*((Settings!$B$2)+1),$F379*$E$9*((Settings!$B$2)+1))),””),\"\")","v":""},{"$f":"IFERROR(IF($F379>0,$AA379*(1-Settings!$B$3),\"\"),\"\")","v":""},"",null,null,null,null,"","","",0,"",0,0,{"$f":"IF($C379<>\"\",GetStockNumParam($C379,\"h\"),\"\")","v":""},0,"",""]
["",null,null,null,null,null,null,null,null,null,null,"","","","","",{"$f":"IFERROR(IF($F380>0,IF($B$6=\"Canada\",IF($E380=\"CAD\",$F380*((Settings!$B$2)+1),$F380*$E$9*((Settings!$B$2)+1)), IF($E380=\"USD\",$F380*((Settings!$B$2)+1),$F380*$E$9*((Settings!$B$2)+1))),””),\"\")","v":""},{"$f":"IFERROR(IF($F380>0,$AA380*(1-Settings!$B$3),\"\"),\"\")","v":""},"",null,null,null,null,"","","",0,"",0,0,{"$f":"IF($C380<>\"\",GetStockNumParam($C380,\"h\"),\"\")","v":""},0,"",""]
["",null,null,null,null,null,null,null,null,null,null,"","","","","",{"$f":"IFERROR(IF($F381>0,IF($B$6=\"Canada\",IF($E381=\"CAD\",$F381*((Settings!$B$2)+1),$F381*$E$9*((Settings!$B$2)+1)), IF($E381=\"USD\",$F381*((Settings!$B$2)+1),$F381*$E$9*((Settings!$B$2)+1))),””),\"\")","v":""},{"$f":"IFERROR(IF($F381>0,$AA381*(1-Settings!$B$3),\"\"),\"\")","v":""},"",null,null,null,null,"","","",0,"",0,0,{"$f":"IF($C381<>\"\",GetStockNumParam($C381,\"h\"),\"\")","v":""},0,"",""]
["",null,null,null,null,null,null,null,null,null,null,"","","","","",{"$f":"IFERROR(IF($F382>0,IF($B$6=\"Canada\",IF($E382=\"CAD\",$F382*((Settings!$B$2)+1),$F382*$E$9*((Settings!$B$2)+1)), IF($E382=\"USD\",$F382*((Settings!$B$2)+1),$F382*$E$9*((Settings!$B$2)+1))),””),\"\")","v":""},{"$f":"IFERROR(IF($F382>0,$AA382*(1-Settings!$B$3),\"\"),\"\")","v":""},"",null,null,null,null,"","","",0,"",0,0,{"$f":"IF($C382<>\"\",GetStockNumParam($C382,\"h\"),\"\")","v":""},0,"",""]
["",null,null,null,null,null,null,null,null,null,null,"","","","","",{"$f":"IFERROR(IF($F383>0,IF($B$6=\"Canada\",IF($E383=\"CAD\",$F383*((Settings!$B$2)+1),$F383*$E$9*((Settings!$B$2)+1)), IF($E383=\"USD\",$F383*((Settings!$B$2)+1),$F383*$E$9*((Settings!$B$2)+1))),””),\"\")","v":""},{"$f":"IFERROR(IF($F383>0,$AA383*(1-Settings!$B$3),\"\"),\"\")","v":""},"",null,null,null,null,"","","",0,"",0,0,{"$f":"IF($C383<>\"\",GetStockNumParam($C383,\"h\"),\"\")","v":""},0,"",""]
["",null,null,null,null,null,null,null,null,null,null,"","","","","",{"$f":"IFERROR(IF($F384>0,IF($B$6=\"Canada\",IF($E384=\"CAD\",$F384*((Settings!$B$2)+1),$F384*$E$9*((Settings!$B$2)+1)), IF($E384=\"USD\",$F384*((Settings!$B$2)+1),$F384*$E$9*((Settings!$B$2)+1))),””),\"\")","v":""},{"$f":"IFERROR(IF($F384>0,$AA384*(1-Settings!$B$3),\"\"),\"\")","v":""},"",null,null,null,null,"","","",0,"",0,0,{"$f":"IF($C384<>\"\",GetStockNumParam($C384,\"h\"),\"\")","v":""},0,"",""]
["",null,null,null,null,null,null,null,null,null,null,"","","","","",{"$f":"IFERROR(IF($F385>0,IF($B$6=\"Canada\",IF($E385=\"CAD\",$F385*((Settings!$B$2)+1),$F385*$E$9*((Settings!$B$2)+1)), IF($E385=\"USD\",$F385*((Settings!$B$2)+1),$F385*$E$9*((Settings!$B$2)+1))),””),\"\")","v":""},{"$f":"IFERROR(IF($F385>0,$AA385*(1-Settings!$B$3),\"\"),\"\")","v":""},"",null,null,null,null,"","","",0,"",0,0,{"$f":"IF($C385<>\"\",GetStockNumParam($C385,\"h\"),\"\")","v":""},0,"",""]
["",null,null,null,null,null,null,null,null,null,null,"","","","","",{"$f":"IFERROR(IF($F386>0,IF($B$6=\"Canada\",IF($E386=\"CAD\",$F386*((Settings!$B$2)+1),$F386*$E$9*((Settings!$B$2)+1)), IF($E386=\"USD\",$F386*((Settings!$B$2)+1),$F386*$E$9*((Settings!$B$2)+1))),””),\"\")","v":""},{"$f":"IFERROR(IF($F386>0,$AA386*(1-Settings!$B$3),\"\"),\"\")","v":""},"",null,null,null,null,"","","",0,"",0,0,{"$f":"IF($C386<>\"\",GetStockNumParam($C386,\"h\"),\"\")","v":""},0,"",""]
["",null,null,null,null,null,null,null,null,null,null,"","","","","",{"$f":"IFERROR(IF($F387>0,IF($B$6=\"Canada\",IF($E387=\"CAD\",$F387*((Settings!$B$2)+1),$F387*$E$9*((Settings!$B$2)+1)), IF($E387=\"USD\",$F387*((Settings!$B$2)+1),$F387*$E$9*((Settings!$B$2)+1))),””),\"\")","v":""},{"$f":"IFERROR(IF($F387>0,$AA387*(1-Settings!$B$3),\"\"),\"\")","v":""},"",null,null,null,null,"","","",0,"",0,0,{"$f":"IF($C387<>\"\",GetStockNumParam($C387,\"h\"),\"\")","v":""},0,"",""]
["",null,null,null,null,null,null,null,null,null,null,"","","","","",{"$f":"IFERROR(IF($F388>0,IF($B$6=\"Canada\",IF($E388=\"CAD\",$F388*((Settings!$B$2)+1),$F388*$E$9*((Settings!$B$2)+1)), IF($E388=\"USD\",$F388*((Settings!$B$2)+1),$F388*$E$9*((Settings!$B$2)+1))),””),\"\")","v":""},{"$f":"IFERROR(IF($F388>0,$AA388*(1-Settings!$B$3),\"\"),\"\")","v":""},"",null,null,null,null,"","","",0,"",0,0,{"$f":"IF($C388<>\"\",GetStockNumParam($C388,\"h\"),\"\")","v":""},0,"",""]
["",null,null,null,null,null,null,null,null,null,null,"","","","","",{"$f":"IFERROR(IF($F389>0,IF($B$6=\"Canada\",IF($E389=\"CAD\",$F389*((Settings!$B$2)+1),$F389*$E$9*((Settings!$B$2)+1)), IF($E389=\"USD\",$F389*((Settings!$B$2)+1),$F389*$E$9*((Settings!$B$2)+1))),””),\"\")","v":""},{"$f":"IFERROR(IF($F389>0,$AA389*(1-Settings!$B$3),\"\"),\"\")","v":""},"",null,null,null,null,"","","",0,"",0,0,{"$f":"IF($C389<>\"\",GetStockNumParam($C389,\"h\"),\"\")","v":""},0,"",""]
["",null,null,null,null,null,null,null,null,null,null,"","","","","",{"$f":"IFERROR(IF($F390>0,IF($B$6=\"Canada\",IF($E390=\"CAD\",$F390*((Settings!$B$2)+1),$F390*$E$9*((Settings!$B$2)+1)), IF($E390=\"USD\",$F390*((Settings!$B$2)+1),$F390*$E$9*((Settings!$B$2)+1))),””),\"\")","v":""},{"$f":"IFERROR(IF($F390>0,$AA390*(1-Settings!$B$3),\"\"),\"\")","v":""},"",null,null,null,null,"","","",0,"",0,0,{"$f":"IF($C390<>\"\",GetStockNumParam($C390,\"h\"),\"\")","v":""},0,"",""]
["",null,null,null,null,null,null,null,null,null,null,"","","","","",{"$f":"IFERROR(IF($F391>0,IF($B$6=\"Canada\",IF($E391=\"CAD\",$F391*((Settings!$B$2)+1),$F391*$E$9*((Settings!$B$2)+1)), IF($E391=\"USD\",$F391*((Settings!$B$2)+1),$F391*$E$9*((Settings!$B$2)+1))),””),\"\")","v":""},{"$f":"IFERROR(IF($F391>0,$AA391*(1-Settings!$B$3),\"\"),\"\")","v":""},"",null,null,null,null,"","","",0,"",0,0,{"$f":"IF($C391<>\"\",GetStockNumParam($C391,\"h\"),\"\")","v":""},0,"",""]
["",null,null,null,null,null,null,null,null,null,null,"","","","","",{"$f":"IFERROR(IF($F392>0,IF($B$6=\"Canada\",IF($E392=\"CAD\",$F392*((Settings!$B$2)+1),$F392*$E$9*((Settings!$B$2)+1)), IF($E392=\"USD\",$F392*((Settings!$B$2)+1),$F392*$E$9*((Settings!$B$2)+1))),””),\"\")","v":""},{"$f":"IFERROR(IF($F392>0,$AA392*(1-Settings!$B$3),\"\"),\"\")","v":""},"",null,null,null,null,"","","",0,"",0,0,{"$f":"IF($C392<>\"\",GetStockNumParam($C392,\"h\"),\"\")","v":""},0,"",""]
["",null,null,null,null,null,null,null,null,null,null,"","","","","",{"$f":"IFERROR(IF($F393>0,IF($B$6=\"Canada\",IF($E393=\"CAD\",$F393*((Settings!$B$2)+1),$F393*$E$9*((Settings!$B$2)+1)), IF($E393=\"USD\",$F393*((Settings!$B$2)+1),$F393*$E$9*((Settings!$B$2)+1))),””),\"\")","v":""},{"$f":"IFERROR(IF($F393>0,$AA393*(1-Settings!$B$3),\"\"),\"\")","v":""},"",null,null,null,null,"","","",0,"",0,0,{"$f":"IF($C393<>\"\",GetStockNumParam($C393,\"h\"),\"\")","v":""},0,"",""]
["",null,null,null,null,null,null,null,null,null,null,"","","","","",{"$f":"IFERROR(IF($F394>0,IF($B$6=\"Canada\",IF($E394=\"CAD\",$F394*((Settings!$B$2)+1),$F394*$E$9*((Settings!$B$2)+1)), IF($E394=\"USD\",$F394*((Settings!$B$2)+1),$F394*$E$9*((Settings!$B$2)+1))),””),\"\")","v":""},{"$f":"IFERROR(IF($F394>0,$AA394*(1-Settings!$B$3),\"\"),\"\")","v":""},"",null,null,null,null,"","","",0,"",0,0,{"$f":"IF($C394<>\"\",GetStockNumParam($C394,\"h\"),\"\")","v":""},0,"",""]
["",null,null,null,null,null,null,null,null,null,null,"","","","","",{"$f":"IFERROR(IF($F395>0,IF($B$6=\"Canada\",IF($E395=\"CAD\",$F395*((Settings!$B$2)+1),$F395*$E$9*((Settings!$B$2)+1)), IF($E395=\"USD\",$F395*((Settings!$B$2)+1),$F395*$E$9*((Settings!$B$2)+1))),””),\"\")","v":""},{"$f":"IFERROR(IF($F395>0,$AA395*(1-Settings!$B$3),\"\"),\"\")","v":""},"",null,null,null,null,"","","",0,"",0,0,{"$f":"IF($C395<>\"\",GetStockNumParam($C395,\"h\"),\"\")","v":""},0,"",""]
[{"$f":"IF($C396=\"\",\"\",GetName($C396))","v":""},null,null,null,null,null,null,null,null,null,null,"","","","","",{"$f":"IFERROR(IF($F396>0,IF($B$6=\"Canada\",IF($E396=\"CAD\",$F396*((Settings!$B$2)+1),$F396*$E$9*((Settings!$B$2)+1)), IF($E396=\"USD\",$F396*((Settings!$B$2)+1),$F396*$E$9*((Settings!$B$2)+1))),””),\"\")","v":""},{"$f":"IFERROR(IF($F396>0,$AA396*(1-Settings!$B$3),\"\"),\"\")","v":""},"",null,null,null,null,"","","",{"$f":"IF($B$6=\"Canada\",\nIF($E396=\"CAD\",IF($F396>$K396,$F396,$K396),IF(($F396*$E$9)>$K396,($F396*$E$9),$K396)),\nIF($E396=\"CAD\",IF(($F396*$E$9)>$K396,($F396*$E$9),$K396),IF($F396>$K396,$F396,$K396)))","v":0},{"$f":"IF($B396=\"Simulate\",0,IF(N396 = \"SOLD\", 0, N396))","v":""},{"$f":"IF($B396=\"Simulate\",0,IF(N396 = \"SOLD\",0,I396))","v":0},0,{"$f":"IF($C396<>\"\",GetStockNumParam($C396,\"h\"),\"\")","v":""},{"$f":"IF($B396=\"Simulate\",0,$I396)","v":0},{"$f":"IF($B396=\"Simulate\",0,Z396)","v":""},{"$f":"IF($B396=\"Simulate\",\"\",$O396)","v":""}]
["",null,null,null,null,null,null,null,null,null,null,"","","","","",{"$f":"IFERROR(IF($F397>0,IF($B$6=\"Canada\",IF($E397=\"CAD\",$F397*((Settings!$B$2)+1),$F397*$E$9*((Settings!$B$2)+1)), IF($E397=\"USD\",$F397*((Settings!$B$2)+1),$F397*$E$9*((Settings!$B$2)+1))),””),\"\")","v":""},{"$f":"IFERROR(IF($F397>0,$AA397*(1-Settings!$B$3),\"\"),\"\")","v":""},"",null,null,null,null,"","","",0,"",0,0,{"$f":"IF($C397<>\"\",GetStockNumParam($C397,\"h\"),\"\")","v":""},0,"",""]
["",null,null,null,null,null,null,null,null,null,null,"","","","","",{"$f":"IFERROR(IF($F398>0,IF($B$6=\"Canada\",IF($E398=\"CAD\",$F398*((Settings!$B$2)+1),$F398*$E$9*((Settings!$B$2)+1)), IF($E398=\"USD\",$F398*((Settings!$B$2)+1),$F398*$E$9*((Settings!$B$2)+1))),””),\"\")","v":""},{"$f":"IFERROR(IF($F398>0,$AA398*(1-Settings!$B$3),\"\"),\"\")","v":""},"",null,null,null,null,"","","",0,"",0,0,{"$f":"IF($C398<>\"\",GetStockNumParam($C398,\"h\"),\"\")","v":""},0,"",""]
["",null,null,null,null,null,null,null,null,null,null,"","","","","",{"$f":"IFERROR(IF($F399>0,IF($B$6=\"Canada\",IF($E399=\"CAD\",$F399*((Settings!$B$2)+1),$F399*$E$9*((Settings!$B$2)+1)), IF($E399=\"USD\",$F399*((Settings!$B$2)+1),$F399*$E$9*((Settings!$B$2)+1))),””),\"\")","v":""},{"$f":"IFERROR(IF($F399>0,$AA399*(1-Settings!$B$3),\"\"),\"\")","v":""},"",null,null,null,null,"","","",0,"",0,0,{"$f":"IF($C399<>\"\",GetStockNumParam($C399,\"h\"),\"\")","v":""},0,"",""]
["",null,null,null,null,null,null,null,null,null,null,"","","","","",{"$f":"IFERROR(IF($F400>0,IF($B$6=\"Canada\",IF($E400=\"CAD\",$F400*((Settings!$B$2)+1),$F400*$E$9*((Settings!$B$2)+1)), IF($E400=\"USD\",$F400*((Settings!$B$2)+1),$F400*$E$9*((Settings!$B$2)+1))),””),\"\")","v":""},{"$f":"IFERROR(IF($F400>0,$AA400*(1-Settings!$B$3),\"\"),\"\")","v":""},"",null,null,null,null,"","","",0,"",0,0,{"$f":"IF($C400<>\"\",GetStockNumParam($C400,\"h\"),\"\")","v":""},0,"",""]
["",null,null,null,null,null,null,null,null,null,null,"","","","","",{"$f":"IFERROR(IF($F401>0,IF($B$6=\"Canada\",IF($E401=\"CAD\",$F401*((Settings!$B$2)+1),$F401*$E$9*((Settings!$B$2)+1)), IF($E401=\"USD\",$F401*((Settings!$B$2)+1),$F401*$E$9*((Settings!$B$2)+1))),””),\"\")","v":""},{"$f":"IFERROR(IF($F401>0,$AA401*(1-Settings!$B$3),\"\"),\"\")","v":""},"",null,null,null,null,"","","",0,"",0,0,{"$f":"IF($C401<>\"\",GetStockNumParam($C401,\"h\"),\"\")","v":""},0,"",""]
["",null,null,null,null,null,null,null,null,null,null,"","","","","",{"$f":"IFERROR(IF($F402>0,IF($B$6=\"Canada\",IF($E402=\"CAD\",$F402*((Settings!$B$2)+1),$F402*$E$9*((Settings!$B$2)+1)), IF($E402=\"USD\",$F402*((Settings!$B$2)+1),$F402*$E$9*((Settings!$B$2)+1))),””),\"\")","v":""},{"$f":"IFERROR(IF($F402>0,$AA402*(1-Settings!$B$3),\"\"),\"\")","v":""},"",null,null,null,null,"","","",0,"",0,0,{"$f":"IF($C402<>\"\",GetStockNumParam($C402,\"h\"),\"\")","v":""},0,"",""]
["",null,null,null,null,null,null,null,null,null,null,"","","","","",{"$f":"IFERROR(IF($F403>0,IF($B$6=\"Canada\",IF($E403=\"CAD\",$F403*((Settings!$B$2)+1),$F403*$E$9*((Settings!$B$2)+1)), IF($E403=\"USD\",$F403*((Settings!$B$2)+1),$F403*$E$9*((Settings!$B$2)+1))),””),\"\")","v":""},{"$f":"IFERROR(IF($F403>0,$AA403*(1-Settings!$B$3),\"\"),\"\")","v":""},"",null,null,null,null,"","","",0,"",0,0,{"$f":"IF($C403<>\"\",GetStockNumParam($C403,\"h\"),\"\")","v":""},0,"",""]
["",null,null,null,null,null,null,null,null,null,null,"","","","","",{"$f":"IFERROR(IF($F404>0,IF($B$6=\"Canada\",IF($E404=\"CAD\",$F404*((Settings!$B$2)+1),$F404*$E$9*((Settings!$B$2)+1)), IF($E404=\"USD\",$F404*((Settings!$B$2)+1),$F404*$E$9*((Settings!$B$2)+1))),””),\"\")","v":""},{"$f":"IFERROR(IF($F404>0,$AA404*(1-Settings!$B$3),\"\"),\"\")","v":""},"",null,null,null,null,"","","",0,"",0,0,{"$f":"IF($C404<>\"\",GetStockNumParam($C404,\"h\"),\"\")","v":""},0,"",""]
["",null,null,null,null,null,null,null,null,null,null,"","","","","",{"$f":"IFERROR(IF($F405>0,IF($B$6=\"Canada\",IF($E405=\"CAD\",$F405*((Settings!$B$2)+1),$F405*$E$9*((Settings!$B$2)+1)), IF($E405=\"USD\",$F405*((Settings!$B$2)+1),$F405*$E$9*((Settings!$B$2)+1))),””),\"\")","v":""},{"$f":"IFERROR(IF($F405>0,$AA405*(1-Settings!$B$3),\"\"),\"\")","v":""},"",null,null,null,null,"","","",0,"",0,0,{"$f":"IF($C405<>\"\",GetStockNumParam($C405,\"h\"),\"\")","v":""},0,"",""]
["",null,null,null,null,null,null,null,null,null,null,"","","","","",{"$f":"IFERROR(IF($F406>0,IF($B$6=\"Canada\",IF($E406=\"CAD\",$F406*((Settings!$B$2)+1),$F406*$E$9*((Settings!$B$2)+1)), IF($E406=\"USD\",$F406*((Settings!$B$2)+1),$F406*$E$9*((Settings!$B$2)+1))),””),\"\")","v":""},{"$f":"IFERROR(IF($F406>0,$AA406*(1-Settings!$B$3),\"\"),\"\")","v":""},"",null,null,null,null,"","","",0,"",0,0,{"$f":"IF($C406<>\"\",GetStockNumParam($C406,\"h\"),\"\")","v":""},0,"",""]
["",null,null,null,null,null,null,null,null,null,null,"","","","","",{"$f":"IFERROR(IF($F407>0,IF($B$6=\"Canada\",IF($E407=\"CAD\",$F407*((Settings!$B$2)+1),$F407*$E$9*((Settings!$B$2)+1)), IF($E407=\"USD\",$F407*((Settings!$B$2)+1),$F407*$E$9*((Settings!$B$2)+1))),””),\"\")","v":""},{"$f":"IFERROR(IF($F407>0,$AA407*(1-Settings!$B$3),\"\"),\"\")","v":""},"",null,null,null,null,"","","",0,"",0,0,{"$f":"IF($C407<>\"\",GetStockNumParam($C407,\"h\"),\"\")","v":""},0,"",""]
["",null,null,null,null,null,null,null,null,null,null,"","","","","",{"$f":"IFERROR(IF($F408>0,IF($B$6=\"Canada\",IF($E408=\"CAD\",$F408*((Settings!$B$2)+1),$F408*$E$9*((Settings!$B$2)+1)), IF($E408=\"USD\",$F408*((Settings!$B$2)+1),$F408*$E$9*((Settings!$B$2)+1))),””),\"\")","v":""},{"$f":"IFERROR(IF($F408>0,$AA408*(1-Settings!$B$3),\"\"),\"\")","v":""},"",null,null,null,null,"","","",0,"",0,0,{"$f":"IF($C408<>\"\",GetStockNumParam($C408,\"h\"),\"\")","v":""},0,"",""]
["",null,null,null,null,null,null,null,null,null,null,"","","","","",{"$f":"IFERROR(IF($F409>0,IF($B$6=\"Canada\",IF($E409=\"CAD\",$F409*((Settings!$B$2)+1),$F409*$E$9*((Settings!$B$2)+1)), IF($E409=\"USD\",$F409*((Settings!$B$2)+1),$F409*$E$9*((Settings!$B$2)+1))),””),\"\")","v":""},{"$f":"IFERROR(IF($F409>0,$AA409*(1-Settings!$B$3),\"\"),\"\")","v":""},"",null,null,null,null,"","","",0,"",0,0,{"$f":"IF($C409<>\"\",GetStockNumParam($C409,\"h\"),\"\")","v":""},0,"",""]
["",null,null,null,null,null,null,null,null,null,null,"","","","","",{"$f":"IFERROR(IF($F410>0,IF($B$6=\"Canada\",IF($E410=\"CAD\",$F410*((Settings!$B$2)+1),$F410*$E$9*((Settings!$B$2)+1)), IF($E410=\"USD\",$F410*((Settings!$B$2)+1),$F410*$E$9*((Settings!$B$2)+1))),””),\"\")","v":""},{"$f":"IFERROR(IF($F410>0,$AA410*(1-Settings!$B$3),\"\"),\"\")","v":""},"",null,null,null,null,"","","",0,"",0,0,{"$f":"IF($C410<>\"\",GetStockNumParam($C410,\"h\"),\"\")","v":""},0,"",""]
["",null,null,null,null,null,null,null,null,null,null,"","","","","",{"$f":"IFERROR(IF($F411>0,IF($B$6=\"Canada\",IF($E411=\"CAD\",$F411*((Settings!$B$2)+1),$F411*$E$9*((Settings!$B$2)+1)), IF($E411=\"USD\",$F411*((Settings!$B$2)+1),$F411*$E$9*((Settings!$B$2)+1))),””),\"\")","v":""},{"$f":"IFERROR(IF($F411>0,$AA411*(1-Settings!$B$3),\"\"),\"\")","v":""},"",null,null,null,null,"","","",0,"",0,0,{"$f":"IF($C411<>\"\",GetStockNumParam($C411,\"h\"),\"\")","v":""},0,"",""]
["",null,null,null,null,null,null,null,null,null,null,"","","","","",{"$f":"IFERROR(IF($F412>0,IF($B$6=\"Canada\",IF($E412=\"CAD\",$F412*((Settings!$B$2)+1),$F412*$E$9*((Settings!$B$2)+1)), IF($E412=\"USD\",$F412*((Settings!$B$2)+1),$F412*$E$9*((Settings!$B$2)+1))),””),\"\")","v":""},{"$f":"IFERROR(IF($F412>0,$AA412*(1-Settings!$B$3),\"\"),\"\")","v":""},"",null,null,null,null,"","","",0,"",0,0,{"$f":"IF($C412<>\"\",GetStockNumParam($C412,\"h\"),\"\")","v":""},0,"",""]
["",null,null,null,null,null,null,null,null,null,null,"","","","","",{"$f":"IFERROR(IF($F413>0,IF($B$6=\"Canada\",IF($E413=\"CAD\",$F413*((Settings!$B$2)+1),$F413*$E$9*((Settings!$B$2)+1)), IF($E413=\"USD\",$F413*((Settings!$B$2)+1),$F413*$E$9*((Settings!$B$2)+1))),””),\"\")","v":""},{"$f":"IFERROR(IF($F413>0,$AA413*(1-Settings!$B$3),\"\"),\"\")","v":""},"",null,null,null,null,"","","",0,"",0,0,{"$f":"IF($C413<>\"\",GetStockNumParam($C413,\"h\"),\"\")","v":""},0,"",""]
["",null,null,null,null,null,null,null,null,null,null,"","","","","",{"$f":"IFERROR(IF($F414>0,IF($B$6=\"Canada\",IF($E414=\"CAD\",$F414*((Settings!$B$2)+1),$F414*$E$9*((Settings!$B$2)+1)), IF($E414=\"USD\",$F414*((Settings!$B$2)+1),$F414*$E$9*((Settings!$B$2)+1))),””),\"\")","v":""},{"$f":"IFERROR(IF($F414>0,$AA414*(1-Settings!$B$3),\"\"),\"\")","v":""},"",null,null,null,null,"","","",0,"",0,0,{"$f":"IF($C414<>\"\",GetStockNumParam($C414,\"h\"),\"\")","v":""},0,"",""]
["",null,null,null,null,null,null,null,null,null,null,"","","","","",{"$f":"IFERROR(IF($F415>0,IF($B$6=\"Canada\",IF($E415=\"CAD\",$F415*((Settings!$B$2)+1),$F415*$E$9*((Settings!$B$2)+1)), IF($E415=\"USD\",$F415*((Settings!$B$2)+1),$F415*$E$9*((Settings!$B$2)+1))),””),\"\")","v":""},{"$f":"IFERROR(IF($F415>0,$AA415*(1-Settings!$B$3),\"\"),\"\")","v":""},"",null,null,null,null,"","","",0,"",0,0,{"$f":"IF($C415<>\"\",GetStockNumParam($C415,\"h\"),\"\")","v":""},0,"",""]
["",null,null,null,null,null,null,null,null,null,null,"","","","","",{"$f":"IFERROR(IF($F416>0,IF($B$6=\"Canada\",IF($E416=\"CAD\",$F416*((Settings!$B$2)+1),$F416*$E$9*((Settings!$B$2)+1)), IF($E416=\"USD\",$F416*((Settings!$B$2)+1),$F416*$E$9*((Settings!$B$2)+1))),””),\"\")","v":""},{"$f":"IFERROR(IF($F416>0,$AA416*(1-Settings!$B$3),\"\"),\"\")","v":""},"",null,null,null,null,"","","",0,"",0,0,{"$f":"IF($C416<>\"\",GetStockNumParam($C416,\"h\"),\"\")","v":""},0,"",""]
["",null,null,null,null,null,null,null,null,null,null,"","","","","",{"$f":"IFERROR(IF($F417>0,IF($B$6=\"Canada\",IF($E417=\"CAD\",$F417*((Settings!$B$2)+1),$F417*$E$9*((Settings!$B$2)+1)), IF($E417=\"USD\",$F417*((Settings!$B$2)+1),$F417*$E$9*((Settings!$B$2)+1))),””),\"\")","v":""},{"$f":"IFERROR(IF($F417>0,$AA417*(1-Settings!$B$3),\"\"),\"\")","v":""},"",null,null,null,null,"","","",0,"",0,0,{"$f":"IF($C417<>\"\",GetStockNumParam($C417,\"h\"),\"\")","v":""},0,"",""]
["",null,null,null,null,null,null,null,null,null,null,"","","","","",{"$f":"IFERROR(IF($F418>0,IF($B$6=\"Canada\",IF($E418=\"CAD\",$F418*((Settings!$B$2)+1),$F418*$E$9*((Settings!$B$2)+1)), IF($E418=\"USD\",$F418*((Settings!$B$2)+1),$F418*$E$9*((Settings!$B$2)+1))),””),\"\")","v":""},{"$f":"IFERROR(IF($F418>0,$AA418*(1-Settings!$B$3),\"\"),\"\")","v":""},"",null,null,null,null,"","","",0,"",0,0,{"$f":"IF($C418<>\"\",GetStockNumParam($C418,\"h\"),\"\")","v":""},0,"",""]
["",null,null,null,null,null,null,null,null,null,null,"","","","","",{"$f":"IFERROR(IF($F419>0,IF($B$6=\"Canada\",IF($E419=\"CAD\",$F419*((Settings!$B$2)+1),$F419*$E$9*((Settings!$B$2)+1)), IF($E419=\"USD\",$F419*((Settings!$B$2)+1),$F419*$E$9*((Settings!$B$2)+1))),””),\"\")","v":""},{"$f":"IFERROR(IF($F419>0,$AA419*(1-Settings!$B$3),\"\"),\"\")","v":""},"",null,null,null,null,"","","",0,"",0,0,{"$f":"IF($C419<>\"\",GetStockNumParam($C419,\"h\"),\"\")","v":""},0,"",""]
["",null,null,null,null,null,null,null,null,null,null,"","","","","",{"$f":"IFERROR(IF($F420>0,IF($B$6=\"Canada\",IF($E420=\"CAD\",$F420*((Settings!$B$2)+1),$F420*$E$9*((Settings!$B$2)+1)), IF($E420=\"USD\",$F420*((Settings!$B$2)+1),$F420*$E$9*((Settings!$B$2)+1))),””),\"\")","v":""},{"$f":"IFERROR(IF($F420>0,$AA420*(1-Settings!$B$3),\"\"),\"\")","v":""},"",null,null,null,null,"","","",0,"",0,0,{"$f":"IF($C420<>\"\",GetStockNumParam($C420,\"h\"),\"\")","v":""},0,"",""]
["",null,null,null,null,null,null,null,null,null,null,"","","","","",{"$f":"IFERROR(IF($F421>0,IF($B$6=\"Canada\",IF($E421=\"CAD\",$F421*((Settings!$B$2)+1),$F421*$E$9*((Settings!$B$2)+1)), IF($E421=\"USD\",$F421*((Settings!$B$2)+1),$F421*$E$9*((Settings!$B$2)+1))),””),\"\")","v":""},{"$f":"IFERROR(IF($F421>0,$AA421*(1-Settings!$B$3),\"\"),\"\")","v":""},"",null,null,null,null,"","","",0,"",0,0,{"$f":"IF($C421<>\"\",GetStockNumParam($C421,\"h\"),\"\")","v":""},0,"",""]
["",null,null,null,null,null,null,null,null,null,null,"","","","","",{"$f":"IFERROR(IF($F422>0,IF($B$6=\"Canada\",IF($E422=\"CAD\",$F422*((Settings!$B$2)+1),$F422*$E$9*((Settings!$B$2)+1)), IF($E422=\"USD\",$F422*((Settings!$B$2)+1),$F422*$E$9*((Settings!$B$2)+1))),””),\"\")","v":""},{"$f":"IFERROR(IF($F422>0,$AA422*(1-Settings!$B$3),\"\"),\"\")","v":""},"",null,null,null,null,"","","",0,"",0,0,{"$f":"IF($C422<>\"\",GetStockNumParam($C422,\"h\"),\"\")","v":""},0,"",""]
["",null,null,null,null,null,null,null,null,null,null,"","","","","",{"$f":"IFERROR(IF($F423>0,IF($B$6=\"Canada\",IF($E423=\"CAD\",$F423*((Settings!$B$2)+1),$F423*$E$9*((Settings!$B$2)+1)), IF($E423=\"USD\",$F423*((Settings!$B$2)+1),$F423*$E$9*((Settings!$B$2)+1))),””),\"\")","v":""},{"$f":"IFERROR(IF($F423>0,$AA423*(1-Settings!$B$3),\"\"),\"\")","v":""},"",null,null,null,null,"","","",0,"",0,0,{"$f":"IF($C423<>\"\",GetStockNumParam($C423,\"h\"),\"\")","v":""},0,"",""]
["",null,null,null,null,null,null,null,null,null,null,"","","","","",{"$f":"IFERROR(IF($F424>0,IF($B$6=\"Canada\",IF($E424=\"CAD\",$F424*((Settings!$B$2)+1),$F424*$E$9*((Settings!$B$2)+1)), IF($E424=\"USD\",$F424*((Settings!$B$2)+1),$F424*$E$9*((Settings!$B$2)+1))),””),\"\")","v":""},{"$f":"IFERROR(IF($F424>0,$AA424*(1-Settings!$B$3),\"\"),\"\")","v":""},"",null,null,null,null,"","","",0,"",0,0,{"$f":"IF($C424<>\"\",GetStockNumParam($C424,\"h\"),\"\")","v":""},0,"",""]
["",null,null,null,null,null,null,null,null,null,null,"","","","","",{"$f":"IFERROR(IF($F425>0,IF($B$6=\"Canada\",IF($E425=\"CAD\",$F425*((Settings!$B$2)+1),$F425*$E$9*((Settings!$B$2)+1)), IF($E425=\"USD\",$F425*((Settings!$B$2)+1),$F425*$E$9*((Settings!$B$2)+1))),””),\"\")","v":""},{"$f":"IFERROR(IF($F425>0,$AA425*(1-Settings!$B$3),\"\"),\"\")","v":""},"",null,null,null,null,"","","",0,"",0,0,{"$f":"IF($C425<>\"\",GetStockNumParam($C425,\"h\"),\"\")","v":""},0,"",""]
["",null,null,null,null,null,null,null,null,null,null,"","","","","",{"$f":"IFERROR(IF($F426>0,IF($B$6=\"Canada\",IF($E426=\"CAD\",$F426*((Settings!$B$2)+1),$F426*$E$9*((Settings!$B$2)+1)), IF($E426=\"USD\",$F426*((Settings!$B$2)+1),$F426*$E$9*((Settings!$B$2)+1))),””),\"\")","v":""},{"$f":"IFERROR(IF($F426>0,$AA426*(1-Settings!$B$3),\"\"),\"\")","v":""},"",null,null,null,null,"","","",0,"",0,0,{"$f":"IF($C426<>\"\",GetStockNumParam($C426,\"h\"),\"\")","v":""},0,"",""]
["",null,null,null,null,null,null,null,null,null,null,"","","","","",{"$f":"IFERROR(IF($F427>0,IF($B$6=\"Canada\",IF($E427=\"CAD\",$F427*((Settings!$B$2)+1),$F427*$E$9*((Settings!$B$2)+1)), IF($E427=\"USD\",$F427*((Settings!$B$2)+1),$F427*$E$9*((Settings!$B$2)+1))),””),\"\")","v":""},{"$f":"IFERROR(IF($F427>0,$AA427*(1-Settings!$B$3),\"\"),\"\")","v":""},"",null,null,null,null,"","","",0,"",0,0,{"$f":"IF($C427<>\"\",GetStockNumParam($C427,\"h\"),\"\")","v":""},0,"",""]
["",null,null,null,null,null,null,null,null,null,null,"","","","","",{"$f":"IFERROR(IF($F428>0,IF($B$6=\"Canada\",IF($E428=\"CAD\",$F428*((Settings!$B$2)+1),$F428*$E$9*((Settings!$B$2)+1)), IF($E428=\"USD\",$F428*((Settings!$B$2)+1),$F428*$E$9*((Settings!$B$2)+1))),””),\"\")","v":""},{"$f":"IFERROR(IF($F428>0,$AA428*(1-Settings!$B$3),\"\"),\"\")","v":""},"",null,null,null,null,"","","",0,"",0,0,{"$f":"IF($C428<>\"\",GetStockNumParam($C428,\"h\"),\"\")","v":""},0,"",""]
["",null,null,null,null,null,null,null,null,null,null,"","","","","",{"$f":"IFERROR(IF($F429>0,IF($B$6=\"Canada\",IF($E429=\"CAD\",$F429*((Settings!$B$2)+1),$F429*$E$9*((Settings!$B$2)+1)), IF($E429=\"USD\",$F429*((Settings!$B$2)+1),$F429*$E$9*((Settings!$B$2)+1))),””),\"\")","v":""},{"$f":"IFERROR(IF($F429>0,$AA429*(1-Settings!$B$3),\"\"),\"\")","v":""},"",null,null,null,null,"","","",0,"",0,0,{"$f":"IF($C429<>\"\",GetStockNumParam($C429,\"h\"),\"\")","v":""},0,"",""]
["",null,null,null,null,null,null,null,null,null,null,"","","","","",{"$f":"IFERROR(IF($F430>0,IF($B$6=\"Canada\",IF($E430=\"CAD\",$F430*((Settings!$B$2)+1),$F430*$E$9*((Settings!$B$2)+1)), IF($E430=\"USD\",$F430*((Settings!$B$2)+1),$F430*$E$9*((Settings!$B$2)+1))),””),\"\")","v":""},{"$f":"IFERROR(IF($F430>0,$AA430*(1-Settings!$B$3),\"\"),\"\")","v":""},"",null,null,null,null,"","","",0,"",0,0,{"$f":"IF($C430<>\"\",GetStockNumParam($C430,\"h\"),\"\")","v":""},0,"",""]
["",null,null,null,null,null,null,null,null,null,null,"","","","","",{"$f":"IFERROR(IF($F431>0,IF($B$6=\"Canada\",IF($E431=\"CAD\",$F431*((Settings!$B$2)+1),$F431*$E$9*((Settings!$B$2)+1)), IF($E431=\"USD\",$F431*((Settings!$B$2)+1),$F431*$E$9*((Settings!$B$2)+1))),””),\"\")","v":""},{"$f":"IFERROR(IF($F431>0,$AA431*(1-Settings!$B$3),\"\"),\"\")","v":""},"",null,null,null,null,"","","",0,"",0,0,{"$f":"IF($C431<>\"\",GetStockNumParam($C431,\"h\"),\"\")","v":""},0,"",""]
["",null,null,null,null,null,null,null,null,null,null,"","","","","",{"$f":"IFERROR(IF($F432>0,IF($B$6=\"Canada\",IF($E432=\"CAD\",$F432*((Settings!$B$2)+1),$F432*$E$9*((Settings!$B$2)+1)), IF($E432=\"USD\",$F432*((Settings!$B$2)+1),$F432*$E$9*((Settings!$B$2)+1))),””),\"\")","v":""},{"$f":"IFERROR(IF($F432>0,$AA432*(1-Settings!$B$3),\"\"),\"\")","v":""},"",null,null,null,null,"","","",0,"",0,0,{"$f":"IF($C432<>\"\",GetStockNumParam($C432,\"h\"),\"\")","v":""},0,"",""]
["",null,null,null,null,null,null,null,null,null,null,"","","","","",{"$f":"IFERROR(IF($F433>0,IF($B$6=\"Canada\",IF($E433=\"CAD\",$F433*((Settings!$B$2)+1),$F433*$E$9*((Settings!$B$2)+1)), IF($E433=\"USD\",$F433*((Settings!$B$2)+1),$F433*$E$9*((Settings!$B$2)+1))),””),\"\")","v":""},{"$f":"IFERROR(IF($F433>0,$AA433*(1-Settings!$B$3),\"\"),\"\")","v":""},"",null,null,null,null,"","","",0,"",0,0,{"$f":"IF($C433<>\"\",GetStockNumParam($C433,\"h\"),\"\")","v":""},0,"",""]
["",null,null,null,null,null,null,null,null,null,null,"","","","","",{"$f":"IFERROR(IF($F434>0,IF($B$6=\"Canada\",IF($E434=\"CAD\",$F434*((Settings!$B$2)+1),$F434*$E$9*((Settings!$B$2)+1)), IF($E434=\"USD\",$F434*((Settings!$B$2)+1),$F434*$E$9*((Settings!$B$2)+1))),””),\"\")","v":""},{"$f":"IFERROR(IF($F434>0,$AA434*(1-Settings!$B$3),\"\"),\"\")","v":""},"",null,null,null,null,"","","",0,"",0,0,{"$f":"IF($C434<>\"\",GetStockNumParam($C434,\"h\"),\"\")","v":""},0,"",""]
["",null,null,null,null,null,null,null,null,null,null,"","","","","",{"$f":"IFERROR(IF($F435>0,IF($B$6=\"Canada\",IF($E435=\"CAD\",$F435*((Settings!$B$2)+1),$F435*$E$9*((Settings!$B$2)+1)), IF($E435=\"USD\",$F435*((Settings!$B$2)+1),$F435*$E$9*((Settings!$B$2)+1))),””),\"\")","v":""},{"$f":"IFERROR(IF($F435>0,$AA435*(1-Settings!$B$3),\"\"),\"\")","v":""},"",null,null,null,null,"","","",0,"",0,0,{"$f":"IF($C435<>\"\",GetStockNumParam($C435,\"h\"),\"\")","v":""},0,"",""]
["",null,null,null,null,null,null,null,null,null,null,"","","","","",{"$f":"IFERROR(IF($F436>0,IF($B$6=\"Canada\",IF($E436=\"CAD\",$F436*((Settings!$B$2)+1),$F436*$E$9*((Settings!$B$2)+1)), IF($E436=\"USD\",$F436*((Settings!$B$2)+1),$F436*$E$9*((Settings!$B$2)+1))),””),\"\")","v":""},{"$f":"IFERROR(IF($F436>0,$AA436*(1-Settings!$B$3),\"\"),\"\")","v":""},"",null,null,null,null,"","","",0,"",0,0,{"$f":"IF($C436<>\"\",GetStockNumParam($C436,\"h\"),\"\")","v":""},0,"",""]
["",null,null,null,null,null,null,null,null,null,null,"","","","","",{"$f":"IFERROR(IF($F437>0,IF($B$6=\"Canada\",IF($E437=\"CAD\",$F437*((Settings!$B$2)+1),$F437*$E$9*((Settings!$B$2)+1)), IF($E437=\"USD\",$F437*((Settings!$B$2)+1),$F437*$E$9*((Settings!$B$2)+1))),””),\"\")","v":""},{"$f":"IFERROR(IF($F437>0,$AA437*(1-Settings!$B$3),\"\"),\"\")","v":""},"",null,null,null,null,"","","",0,"",0,0,{"$f":"IF($C437<>\"\",GetStockNumParam($C437,\"h\"),\"\")","v":""},0,"",""]
["",null,null,null,null,null,null,null,null,null,null,"","","","","",{"$f":"IFERROR(IF($F438>0,IF($B$6=\"Canada\",IF($E438=\"CAD\",$F438*((Settings!$B$2)+1),$F438*$E$9*((Settings!$B$2)+1)), IF($E438=\"USD\",$F438*((Settings!$B$2)+1),$F438*$E$9*((Settings!$B$2)+1))),””),\"\")","v":""},{"$f":"IFERROR(IF($F438>0,$AA438*(1-Settings!$B$3),\"\"),\"\")","v":""},"",null,null,null,null,"","","",0,"",0,0,{"$f":"IF($C438<>\"\",GetStockNumParam($C438,\"h\"),\"\")","v":""},0,"",""]
["",null,null,null,null,null,null,null,null,null,null,"","","","","",{"$f":"IFERROR(IF($F439>0,IF($B$6=\"Canada\",IF($E439=\"CAD\",$F439*((Settings!$B$2)+1),$F439*$E$9*((Settings!$B$2)+1)), IF($E439=\"USD\",$F439*((Settings!$B$2)+1),$F439*$E$9*((Settings!$B$2)+1))),””),\"\")","v":""},{"$f":"IFERROR(IF($F439>0,$AA439*(1-Settings!$B$3),\"\"),\"\")","v":""},"",null,null,null,null,"","","",0,"",0,0,{"$f":"IF($C439<>\"\",GetStockNumParam($C439,\"h\"),\"\")","v":""},0,"",""]
["",null,null,null,null,null,null,null,null,null,null,"","","","","",{"$f":"IFERROR(IF($F440>0,IF($B$6=\"Canada\",IF($E440=\"CAD\",$F440*((Settings!$B$2)+1),$F440*$E$9*((Settings!$B$2)+1)), IF($E440=\"USD\",$F440*((Settings!$B$2)+1),$F440*$E$9*((Settings!$B$2)+1))),””),\"\")","v":""},{"$f":"IFERROR(IF($F440>0,$AA440*(1-Settings!$B$3),\"\"),\"\")","v":""},"",null,null,null,null,"","","",0,"",0,0,{"$f":"IF($C440<>\"\",GetStockNumParam($C440,\"h\"),\"\")","v":""},0,"",""]
["",null,null,null,null,null,null,null,null,null,null,{"$f":"IF(J441 > 0,K441-J441,\"\")","v":""},{"$f":"IF(J441 > 0,(L441/J441),\"\")","v":""},{"$f":"IF(D441 > 0,IF(T441 > 0,\"SOLD\",D441*K441),\"\")","v":""},{"$f":"IF(D441 > 0,IF(T441 > 0, Z441-I441, N441-I441),\"\")","v":""},{"$f":"IF(D441 > 0,IF(O441=0,0,(O441/I441)),\"\")","v":""},{"$f":"IFERROR(IF($F441>0,IF($B$6=\"Canada\",IF($E441=\"CAD\",$F441*((Settings!$B$2)+1),$F441*$E$9*((Settings!$B$2)+1)), IF($E441=\"USD\",$F441*((Settings!$B$2)+1),$F441*$E$9*((Settings!$B$2)+1))),””),\"\")","v":""},{"$f":"IFERROR(IF($F441>0,$AA441*(1-Settings!$B$3),\"\"),\"\")","v":""},{"$f":"IF(F441>0,IF(K441>=Q441,\"SELL\",IF(K441<=R441,\"STOP\",\"HOLD\")),\"\")","v":""},null,null,null,null,{"$f":"IF(D441 > 0,IF(Z441 = 0,0,Z441-I441),\"\")","v":""},{"$f":"IF(D441 > 0,IF(Z441=0,0,(Z441/I441)-100%),\"\")","v":""},{"$f":"IF(T441 > 0,T441*D441-V441+W441,N441)","v":""},0,"",0,{"$f":"IF(N441 = \"SOLD\", Z441-I441,I441)","v":0},{"$f":"IF($C441<>\"\",GetStockNumParam($C441,\"h\"),\"\")","v":""},0,"",""]
["",null,null,null,null,null,null,null,null,null,null,"","","","","",{"$f":"IFERROR(IF($F442>0,IF($B$6=\"Canada\",IF($E442=\"CAD\",$F442*((Settings!$B$2)+1),$F442*$E$9*((Settings!$B$2)+1)), IF($E442=\"USD\",$F442*((Settings!$B$2)+1),$F442*$E$9*((Settings!$B$2)+1))),””),\"\")","v":""},{"$f":"IFERROR(IF($F442>0,$AA442*(1-Settings!$B$3),\"\"),\"\")","v":""},"",null,null,null,null,"","","",0,"",0,0,{"$f":"IF($C442<>\"\",GetStockNumParam($C442,\"h\"),\"\")","v":""},0,"",""]
["",null,null,null,null,null,null,null,null,null,null,"","","","","",{"$f":"IFERROR(IF($F443>0,IF($B$6=\"Canada\",IF($E443=\"CAD\",$F443*((Settings!$B$2)+1),$F443*$E$9*((Settings!$B$2)+1)), IF($E443=\"USD\",$F443*((Settings!$B$2)+1),$F443*$E$9*((Settings!$B$2)+1))),””),\"\")","v":""},{"$f":"IFERROR(IF($F443>0,$AA443*(1-Settings!$B$3),\"\"),\"\")","v":""},"",null,null,null,null,"","","",0,"",0,0,{"$f":"IF($C443<>\"\",GetStockNumParam($C443,\"h\"),\"\")","v":""},0,"",""]
["",null,null,null,null,null,null,null,null,null,null,"","","","","",{"$f":"IFERROR(IF($F444>0,IF($B$6=\"Canada\",IF($E444=\"CAD\",$F444*((Settings!$B$2)+1),$F444*$E$9*((Settings!$B$2)+1)), IF($E444=\"USD\",$F444*((Settings!$B$2)+1),$F444*$E$9*((Settings!$B$2)+1))),””),\"\")","v":""},{"$f":"IFERROR(IF($F444>0,$AA444*(1-Settings!$B$3),\"\"),\"\")","v":""},"",null,null,null,null,"","","",0,"",0,0,{"$f":"IF($C444<>\"\",GetStockNumParam($C444,\"h\"),\"\")","v":""},0,"",""]
["",null,null,null,null,null,null,null,null,null,null,"","","","","",{"$f":"IFERROR(IF($F445>0,IF($B$6=\"Canada\",IF($E445=\"CAD\",$F445*((Settings!$B$2)+1),$F445*$E$9*((Settings!$B$2)+1)), IF($E445=\"USD\",$F445*((Settings!$B$2)+1),$F445*$E$9*((Settings!$B$2)+1))),””),\"\")","v":""},{"$f":"IFERROR(IF($F445>0,$AA445*(1-Settings!$B$3),\"\"),\"\")","v":""},"",null,null,null,null,"","","",0,"",0,0,{"$f":"IF($C445<>\"\",GetStockNumParam($C445,\"h\"),\"\")","v":""},0,"",""]
["",null,null,null,null,null,null,null,null,null,null,"","","","","",{"$f":"IFERROR(IF($F446>0,IF($B$6=\"Canada\",IF($E446=\"CAD\",$F446*((Settings!$B$2)+1),$F446*$E$9*((Settings!$B$2)+1)), IF($E446=\"USD\",$F446*((Settings!$B$2)+1),$F446*$E$9*((Settings!$B$2)+1))),””),\"\")","v":""},{"$f":"IFERROR(IF($F446>0,$AA446*(1-Settings!$B$3),\"\"),\"\")","v":""},"",null,null,null,null,"","","",0,"",0,0,{"$f":"IF($C446<>\"\",GetStockNumParam($C446,\"h\"),\"\")","v":""},0,"",""]
["",null,null,null,null,null,null,null,null,null,null,"","","","","",{"$f":"IFERROR(IF($F447>0,IF($B$6=\"Canada\",IF($E447=\"CAD\",$F447*((Settings!$B$2)+1),$F447*$E$9*((Settings!$B$2)+1)), IF($E447=\"USD\",$F447*((Settings!$B$2)+1),$F447*$E$9*((Settings!$B$2)+1))),””),\"\")","v":""},{"$f":"IFERROR(IF($F447>0,$AA447*(1-Settings!$B$3),\"\"),\"\")","v":""},"",null,null,null,null,"","","",0,"",0,0,{"$f":"IF($C447<>\"\",GetStockNumParam($C447,\"h\"),\"\")","v":""},0,"",""]
["",null,null,null,null,null,null,null,null,null,null,"","","","","",{"$f":"IFERROR(IF($F448>0,IF($B$6=\"Canada\",IF($E448=\"CAD\",$F448*((Settings!$B$2)+1),$F448*$E$9*((Settings!$B$2)+1)), IF($E448=\"USD\",$F448*((Settings!$B$2)+1),$F448*$E$9*((Settings!$B$2)+1))),””),\"\")","v":""},{"$f":"IFERROR(IF($F448>0,$AA448*(1-Settings!$B$3),\"\"),\"\")","v":""},"",null,null,null,null,"","","",0,"",0,0,{"$f":"IF($C448<>\"\",GetStockNumParam($C448,\"h\"),\"\")","v":""},0,"",""]
["",null,null,null,null,null,null,null,null,null,null,"","","","","",{"$f":"IFERROR(IF($F449>0,IF($B$6=\"Canada\",IF($E449=\"CAD\",$F449*((Settings!$B$2)+1),$F449*$E$9*((Settings!$B$2)+1)), IF($E449=\"USD\",$F449*((Settings!$B$2)+1),$F449*$E$9*((Settings!$B$2)+1))),””),\"\")","v":""},{"$f":"IFERROR(IF($F449>0,$AA449*(1-Settings!$B$3),\"\"),\"\")","v":""},"",null,null,null,null,"","","",0,"",0,0,{"$f":"IF($C449<>\"\",GetStockNumParam($C449,\"h\"),\"\")","v":""},0,"",""]
["",null,null,null,null,null,null,null,null,null,null,"","","","","",{"$f":"IFERROR(IF($F450>0,IF($B$6=\"Canada\",IF($E450=\"CAD\",$F450*((Settings!$B$2)+1),$F450*$E$9*((Settings!$B$2)+1)), IF($E450=\"USD\",$F450*((Settings!$B$2)+1),$F450*$E$9*((Settings!$B$2)+1))),””),\"\")","v":""},{"$f":"IFERROR(IF($F450>0,$AA450*(1-Settings!$B$3),\"\"),\"\")","v":""},"",null,null,null,null,"","","",0,"",0,0,{"$f":"IF($C450<>\"\",GetStockNumParam($C450,\"h\"),\"\")","v":""},0,"",""]
["",null,null,null,null,null,null,null,null,null,null,"","","","","",{"$f":"IFERROR(IF($F451>0,IF($B$6=\"Canada\",IF($E451=\"CAD\",$F451*((Settings!$B$2)+1),$F451*$E$9*((Settings!$B$2)+1)), IF($E451=\"USD\",$F451*((Settings!$B$2)+1),$F451*$E$9*((Settings!$B$2)+1))),””),\"\")","v":""},{"$f":"IFERROR(IF($F451>0,$AA451*(1-Settings!$B$3),\"\"),\"\")","v":""},"",null,null,null,null,"","","",0,"",0,0,{"$f":"IF($C451<>\"\",GetStockNumParam($C451,\"h\"),\"\")","v":""},0,"",""]
["",null,null,null,null,null,null,null,null,null,null,"","","","","",{"$f":"IFERROR(IF($F452>0,IF($B$6=\"Canada\",IF($E452=\"CAD\",$F452*((Settings!$B$2)+1),$F452*$E$9*((Settings!$B$2)+1)), IF($E452=\"USD\",$F452*((Settings!$B$2)+1),$F452*$E$9*((Settings!$B$2)+1))),””),\"\")","v":""},{"$f":"IFERROR(IF($F452>0,$AA452*(1-Settings!$B$3),\"\"),\"\")","v":""},"",null,null,null,null,"","","",0,"",0,0,{"$f":"IF($C452<>\"\",GetStockNumParam($C452,\"h\"),\"\")","v":""},0,"",""]
["",null,null,null,null,null,null,null,null,null,null,"","","","","",{"$f":"IFERROR(IF($F453>0,IF($B$6=\"Canada\",IF($E453=\"CAD\",$F453*((Settings!$B$2)+1),$F453*$E$9*((Settings!$B$2)+1)), IF($E453=\"USD\",$F453*((Settings!$B$2)+1),$F453*$E$9*((Settings!$B$2)+1))),””),\"\")","v":""},{"$f":"IFERROR(IF($F453>0,$AA453*(1-Settings!$B$3),\"\"),\"\")","v":""},"",null,null,null,null,"","","",0,"",0,0,{"$f":"IF($C453<>\"\",GetStockNumParam($C453,\"h\"),\"\")","v":""},0,"",""]
["",null,null,null,null,null,null,null,null,null,null,"","","","","",{"$f":"IFERROR(IF($F454>0,IF($B$6=\"Canada\",IF($E454=\"CAD\",$F454*((Settings!$B$2)+1),$F454*$E$9*((Settings!$B$2)+1)), IF($E454=\"USD\",$F454*((Settings!$B$2)+1),$F454*$E$9*((Settings!$B$2)+1))),””),\"\")","v":""},{"$f":"IFERROR(IF($F454>0,$AA454*(1-Settings!$B$3),\"\"),\"\")","v":""},"",null,null,null,null,"","","",0,"",0,0,{"$f":"IF($C454<>\"\",GetStockNumParam($C454,\"h\"),\"\")","v":""},0,"",""]
["",null,null,null,null,null,null,null,null,null,null,"","","","","",{"$f":"IFERROR(IF($F455>0,IF($B$6=\"Canada\",IF($E455=\"CAD\",$F455*((Settings!$B$2)+1),$F455*$E$9*((Settings!$B$2)+1)), IF($E455=\"USD\",$F455*((Settings!$B$2)+1),$F455*$E$9*((Settings!$B$2)+1))),””),\"\")","v":""},{"$f":"IFERROR(IF($F455>0,$AA455*(1-Settings!$B$3),\"\"),\"\")","v":""},"",null,null,null,null,"","","",0,"",0,0,{"$f":"IF($C455<>\"\",GetStockNumParam($C455,\"h\"),\"\")","v":""},0,"",""]
["",null,null,null,null,null,null,null,null,null,null,"","","","","",{"$f":"IFERROR(IF($F456>0,IF($B$6=\"Canada\",IF($E456=\"CAD\",$F456*((Settings!$B$2)+1),$F456*$E$9*((Settings!$B$2)+1)), IF($E456=\"USD\",$F456*((Settings!$B$2)+1),$F456*$E$9*((Settings!$B$2)+1))),””),\"\")","v":""},{"$f":"IFERROR(IF($F456>0,$AA456*(1-Settings!$B$3),\"\"),\"\")","v":""},"",null,null,null,null,"","","",0,"",0,0,{"$f":"IF($C456<>\"\",GetStockNumParam($C456,\"h\"),\"\")","v":""},0,"",""]
["",null,null,null,null,null,null,null,null,null,null,"","","","","",{"$f":"IFERROR(IF($F457>0,IF($B$6=\"Canada\",IF($E457=\"CAD\",$F457*((Settings!$B$2)+1),$F457*$E$9*((Settings!$B$2)+1)), IF($E457=\"USD\",$F457*((Settings!$B$2)+1),$F457*$E$9*((Settings!$B$2)+1))),””),\"\")","v":""},{"$f":"IFERROR(IF($F457>0,$AA457*(1-Settings!$B$3),\"\"),\"\")","v":""},"",null,null,null,null,"","","",0,"",0,0,{"$f":"IF($C457<>\"\",GetStockNumParam($C457,\"h\"),\"\")","v":""},0,"",""]
["",null,null,null,null,null,null,null,null,null,null,"","","","","",{"$f":"IFERROR(IF($F458>0,IF($B$6=\"Canada\",IF($E458=\"CAD\",$F458*((Settings!$B$2)+1),$F458*$E$9*((Settings!$B$2)+1)), IF($E458=\"USD\",$F458*((Settings!$B$2)+1),$F458*$E$9*((Settings!$B$2)+1))),””),\"\")","v":""},{"$f":"IFERROR(IF($F458>0,$AA458*(1-Settings!$B$3),\"\"),\"\")","v":""},"",null,null,null,null,"","","",0,"",0,0,{"$f":"IF($C458<>\"\",GetStockNumParam($C458,\"h\"),\"\")","v":""},0,"",""]
["",null,null,null,null,null,null,null,null,null,null,"","","","","",{"$f":"IFERROR(IF($F459>0,IF($B$6=\"Canada\",IF($E459=\"CAD\",$F459*((Settings!$B$2)+1),$F459*$E$9*((Settings!$B$2)+1)), IF($E459=\"USD\",$F459*((Settings!$B$2)+1),$F459*$E$9*((Settings!$B$2)+1))),””),\"\")","v":""},{"$f":"IFERROR(IF($F459>0,$AA459*(1-Settings!$B$3),\"\"),\"\")","v":""},"",null,null,null,null,"","","",0,"",0,0,{"$f":"IF($C459<>\"\",GetStockNumParam($C459,\"h\"),\"\")","v":""},0,"",""]
[{"$f":"IF($C460=\"\",\"\",GetName($C460))","v":""},null,null,null,null,null,null,null,null,null,null,"","","","","",{"$f":"IFERROR(IF($F460>0,IF($B$6=\"Canada\",IF($E460=\"CAD\",$F460*((Settings!$B$2)+1),$F460*$E$9*((Settings!$B$2)+1)), IF($E460=\"USD\",$F460*((Settings!$B$2)+1),$F460*$E$9*((Settings!$B$2)+1))),””),\"\")","v":""},{"$f":"IFERROR(IF($F460>0,$AA460*(1-Settings!$B$3),\"\"),\"\")","v":""},"",null,null,null,null,"","","",{"$f":"IF($B$6=\"Canada\",\nIF($E460=\"CAD\",IF($F460>$K460,$F460,$K460),IF(($F460*$E$9)>$K460,($F460*$E$9),$K460)),\nIF($E460=\"CAD\",IF(($F460*$E$9)>$K460,($F460*$E$9),$K460),IF($F460>$K460,$F460,$K460)))","v":0},{"$f":"IF($B460=\"Simulate\",0,IF(N460 = \"SOLD\", 0, N460))","v":""},{"$f":"IF($B460=\"Simulate\",0,IF(N460 = \"SOLD\",0,I460))","v":0},0,{"$f":"IF($C460<>\"\",GetStockNumParam($C460,\"h\"),\"\")","v":""},{"$f":"IF($B460=\"Simulate\",0,$I460)","v":0},{"$f":"IF($B460=\"Simulate\",0,Z460)","v":""},{"$f":"IF($B460=\"Simulate\",\"\",$O460)","v":""}]
["",null,null,null,null,null,null,null,null,null,null,"","","","","",{"$f":"IFERROR(IF($F461>0,IF($B$6=\"Canada\",IF($E461=\"CAD\",$F461*((Settings!$B$2)+1),$F461*$E$9*((Settings!$B$2)+1)), IF($E461=\"USD\",$F461*((Settings!$B$2)+1),$F461*$E$9*((Settings!$B$2)+1))),””),\"\")","v":""},{"$f":"IFERROR(IF($F461>0,$AA461*(1-Settings!$B$3),\"\"),\"\")","v":""},"",null,null,null,null,"","","",0,"",0,0,{"$f":"IF($C461<>\"\",GetStockNumParam($C461,\"h\"),\"\")","v":""},0,"",""]
["",null,null,null,null,null,null,null,null,null,null,"","","","","",{"$f":"IFERROR(IF($F462>0,IF($B$6=\"Canada\",IF($E462=\"CAD\",$F462*((Settings!$B$2)+1),$F462*$E$9*((Settings!$B$2)+1)), IF($E462=\"USD\",$F462*((Settings!$B$2)+1),$F462*$E$9*((Settings!$B$2)+1))),””),\"\")","v":""},{"$f":"IFERROR(IF($F462>0,$AA462*(1-Settings!$B$3),\"\"),\"\")","v":""},"",null,null,null,null,"","","",0,"",0,0,{"$f":"IF($C462<>\"\",GetStockNumParam($C462,\"h\"),\"\")","v":""},0,"",""]
["",null,null,null,null,null,null,null,null,null,null,"","","","","",{"$f":"IFERROR(IF($F463>0,IF($B$6=\"Canada\",IF($E463=\"CAD\",$F463*((Settings!$B$2)+1),$F463*$E$9*((Settings!$B$2)+1)), IF($E463=\"USD\",$F463*((Settings!$B$2)+1),$F463*$E$9*((Settings!$B$2)+1))),””),\"\")","v":""},{"$f":"IFERROR(IF($F463>0,$AA463*(1-Settings!$B$3),\"\"),\"\")","v":""},"",null,null,null,null,"","","",0,"",0,0,{"$f":"IF($C463<>\"\",GetStockNumParam($C463,\"h\"),\"\")","v":""},0,"",""]
["",null,null,null,null,null,null,null,null,null,null,"","","","","",{"$f":"IFERROR(IF($F464>0,IF($B$6=\"Canada\",IF($E464=\"CAD\",$F464*((Settings!$B$2)+1),$F464*$E$9*((Settings!$B$2)+1)), IF($E464=\"USD\",$F464*((Settings!$B$2)+1),$F464*$E$9*((Settings!$B$2)+1))),””),\"\")","v":""},{"$f":"IFERROR(IF($F464>0,$AA464*(1-Settings!$B$3),\"\"),\"\")","v":""},"",null,null,null,null,"","","",0,"",0,0,{"$f":"IF($C464<>\"\",GetStockNumParam($C464,\"h\"),\"\")","v":""},0,"",""]
["",null,null,null,null,null,null,null,null,null,null,"","","","","",{"$f":"IFERROR(IF($F465>0,IF($B$6=\"Canada\",IF($E465=\"CAD\",$F465*((Settings!$B$2)+1),$F465*$E$9*((Settings!$B$2)+1)), IF($E465=\"USD\",$F465*((Settings!$B$2)+1),$F465*$E$9*((Settings!$B$2)+1))),””),\"\")","v":""},{"$f":"IFERROR(IF($F465>0,$AA465*(1-Settings!$B$3),\"\"),\"\")","v":""},"",null,null,null,null,"","","",0,"",0,0,{"$f":"IF($C465<>\"\",GetStockNumParam($C465,\"h\"),\"\")","v":""},0,"",""]
["",null,null,null,null,null,null,null,null,null,null,"","","","","",{"$f":"IFERROR(IF($F466>0,IF($B$6=\"Canada\",IF($E466=\"CAD\",$F466*((Settings!$B$2)+1),$F466*$E$9*((Settings!$B$2)+1)), IF($E466=\"USD\",$F466*((Settings!$B$2)+1),$F466*$E$9*((Settings!$B$2)+1))),””),\"\")","v":""},{"$f":"IFERROR(IF($F466>0,$AA466*(1-Settings!$B$3),\"\"),\"\")","v":""},"",null,null,null,null,"","","",0,"",0,0,{"$f":"IF($C466<>\"\",GetStockNumParam($C466,\"h\"),\"\")","v":""},0,"",""]
["",null,null,null,null,null,null,null,null,null,null,"","","","","",{"$f":"IFERROR(IF($F467>0,IF($B$6=\"Canada\",IF($E467=\"CAD\",$F467*((Settings!$B$2)+1),$F467*$E$9*((Settings!$B$2)+1)), IF($E467=\"USD\",$F467*((Settings!$B$2)+1),$F467*$E$9*((Settings!$B$2)+1))),””),\"\")","v":""},{"$f":"IFERROR(IF($F467>0,$AA467*(1-Settings!$B$3),\"\"),\"\")","v":""},"",null,null,null,null,"","","",0,"",0,0,{"$f":"IF($C467<>\"\",GetStockNumParam($C467,\"h\"),\"\")","v":""},0,"",""]
["",null,null,null,null,null,null,null,null,null,null,"","","","","",{"$f":"IFERROR(IF($F468>0,IF($B$6=\"Canada\",IF($E468=\"CAD\",$F468*((Settings!$B$2)+1),$F468*$E$9*((Settings!$B$2)+1)), IF($E468=\"USD\",$F468*((Settings!$B$2)+1),$F468*$E$9*((Settings!$B$2)+1))),””),\"\")","v":""},{"$f":"IFERROR(IF($F468>0,$AA468*(1-Settings!$B$3),\"\"),\"\")","v":""},"",null,null,null,null,"","","",0,"",0,0,{"$f":"IF($C468<>\"\",GetStockNumParam($C468,\"h\"),\"\")","v":""},0,"",""]
["",null,null,null,null,null,null,null,null,null,null,"","","","","",{"$f":"IFERROR(IF($F469>0,IF($B$6=\"Canada\",IF($E469=\"CAD\",$F469*((Settings!$B$2)+1),$F469*$E$9*((Settings!$B$2)+1)), IF($E469=\"USD\",$F469*((Settings!$B$2)+1),$F469*$E$9*((Settings!$B$2)+1))),””),\"\")","v":""},{"$f":"IFERROR(IF($F469>0,$AA469*(1-Settings!$B$3),\"\"),\"\")","v":""},"",null,null,null,null,"","","",0,"",0,0,{"$f":"IF($C469<>\"\",GetStockNumParam($C469,\"h\"),\"\")","v":""},0,"",""]
["",null,null,null,null,null,null,null,null,null,null,"","","","","",{"$f":"IFERROR(IF($F470>0,IF($B$6=\"Canada\",IF($E470=\"CAD\",$F470*((Settings!$B$2)+1),$F470*$E$9*((Settings!$B$2)+1)), IF($E470=\"USD\",$F470*((Settings!$B$2)+1),$F470*$E$9*((Settings!$B$2)+1))),””),\"\")","v":""},{"$f":"IFERROR(IF($F470>0,$AA470*(1-Settings!$B$3),\"\"),\"\")","v":""},"",null,null,null,null,"","","",0,"",0,0,{"$f":"IF($C470<>\"\",GetStockNumParam($C470,\"h\"),\"\")","v":""},0,"",""]
["",null,null,null,null,null,null,null,null,null,null,"","","","","",{"$f":"IFERROR(IF($F471>0,IF($B$6=\"Canada\",IF($E471=\"CAD\",$F471*((Settings!$B$2)+1),$F471*$E$9*((Settings!$B$2)+1)), IF($E471=\"USD\",$F471*((Settings!$B$2)+1),$F471*$E$9*((Settings!$B$2)+1))),””),\"\")","v":""},{"$f":"IFERROR(IF($F471>0,$AA471*(1-Settings!$B$3),\"\"),\"\")","v":""},"",null,null,null,null,"","","",0,"",0,0,{"$f":"IF($C471<>\"\",GetStockNumParam($C471,\"h\"),\"\")","v":""},0,"",""]
["",null,null,null,null,null,null,null,null,null,null,"","","","","",{"$f":"IFERROR(IF($F472>0,IF($B$6=\"Canada\",IF($E472=\"CAD\",$F472*((Settings!$B$2)+1),$F472*$E$9*((Settings!$B$2)+1)), IF($E472=\"USD\",$F472*((Settings!$B$2)+1),$F472*$E$9*((Settings!$B$2)+1))),””),\"\")","v":""},{"$f":"IFERROR(IF($F472>0,$AA472*(1-Settings!$B$3),\"\"),\"\")","v":""},"",null,null,null,null,"","","",0,"",0,0,{"$f":"IF($C472<>\"\",GetStockNumParam($C472,\"h\"),\"\")","v":""},0,"",""]
["",null,null,null,null,null,null,null,null,null,null,"","","","","",{"$f":"IFERROR(IF($F473>0,IF($B$6=\"Canada\",IF($E473=\"CAD\",$F473*((Settings!$B$2)+1),$F473*$E$9*((Settings!$B$2)+1)), IF($E473=\"USD\",$F473*((Settings!$B$2)+1),$F473*$E$9*((Settings!$B$2)+1))),””),\"\")","v":""},{"$f":"IFERROR(IF($F473>0,$AA473*(1-Settings!$B$3),\"\"),\"\")","v":""},"",null,null,null,null,"","","",0,"",0,0,{"$f":"IF($C473<>\"\",GetStockNumParam($C473,\"h\"),\"\")","v":""},0,"",""]
["",null,null,null,null,null,null,null,null,null,null,"","","","","",{"$f":"IFERROR(IF($F474>0,IF($B$6=\"Canada\",IF($E474=\"CAD\",$F474*((Settings!$B$2)+1),$F474*$E$9*((Settings!$B$2)+1)), IF($E474=\"USD\",$F474*((Settings!$B$2)+1),$F474*$E$9*((Settings!$B$2)+1))),””),\"\")","v":""},{"$f":"IFERROR(IF($F474>0,$AA474*(1-Settings!$B$3),\"\"),\"\")","v":""},"",null,null,null,null,"","","",0,"",0,0,{"$f":"IF($C474<>\"\",GetStockNumParam($C474,\"h\"),\"\")","v":""},0,"",""]
["",null,null,null,null,null,null,null,null,null,null,"","","","","",{"$f":"IFERROR(IF($F475>0,IF($B$6=\"Canada\",IF($E475=\"CAD\",$F475*((Settings!$B$2)+1),$F475*$E$9*((Settings!$B$2)+1)), IF($E475=\"USD\",$F475*((Settings!$B$2)+1),$F475*$E$9*((Settings!$B$2)+1))),””),\"\")","v":""},{"$f":"IFERROR(IF($F475>0,$AA475*(1-Settings!$B$3),\"\"),\"\")","v":""},"",null,null,null,null,"","","",0,"",0,0,{"$f":"IF($C475<>\"\",GetStockNumParam($C475,\"h\"),\"\")","v":""},0,"",""]
["",null,null,null,null,null,null,null,null,null,null,"","","","","",{"$f":"IFERROR(IF($F476>0,IF($B$6=\"Canada\",IF($E476=\"CAD\",$F476*((Settings!$B$2)+1),$F476*$E$9*((Settings!$B$2)+1)), IF($E476=\"USD\",$F476*((Settings!$B$2)+1),$F476*$E$9*((Settings!$B$2)+1))),””),\"\")","v":""},{"$f":"IFERROR(IF($F476>0,$AA476*(1-Settings!$B$3),\"\"),\"\")","v":""},"",null,null,null,null,"","","",0,"",0,0,{"$f":"IF($C476<>\"\",GetStockNumParam($C476,\"h\"),\"\")","v":""},0,"",""]
["",null,null,null,null,null,null,null,null,null,null,"","","","","",{"$f":"IFERROR(IF($F477>0,IF($B$6=\"Canada\",IF($E477=\"CAD\",$F477*((Settings!$B$2)+1),$F477*$E$9*((Settings!$B$2)+1)), IF($E477=\"USD\",$F477*((Settings!$B$2)+1),$F477*$E$9*((Settings!$B$2)+1))),””),\"\")","v":""},{"$f":"IFERROR(IF($F477>0,$AA477*(1-Settings!$B$3),\"\"),\"\")","v":""},"",null,null,null,null,"","","",0,"",0,0,{"$f":"IF($C477<>\"\",GetStockNumParam($C477,\"h\"),\"\")","v":""},0,"",""]
["",null,null,null,null,null,null,null,null,null,null,"","","","","",{"$f":"IFERROR(IF($F478>0,IF($B$6=\"Canada\",IF($E478=\"CAD\",$F478*((Settings!$B$2)+1),$F478*$E$9*((Settings!$B$2)+1)), IF($E478=\"USD\",$F478*((Settings!$B$2)+1),$F478*$E$9*((Settings!$B$2)+1))),””),\"\")","v":""},{"$f":"IFERROR(IF($F478>0,$AA478*(1-Settings!$B$3),\"\"),\"\")","v":""},"",null,null,null,null,"","","",0,"",0,0,{"$f":"IF($C478<>\"\",GetStockNumParam($C478,\"h\"),\"\")","v":""},0,"",""]
["",null,null,null,null,null,null,null,null,null,null,"","","","","",{"$f":"IFERROR(IF($F479>0,IF($B$6=\"Canada\",IF($E479=\"CAD\",$F479*((Settings!$B$2)+1),$F479*$E$9*((Settings!$B$2)+1)), IF($E479=\"USD\",$F479*((Settings!$B$2)+1),$F479*$E$9*((Settings!$B$2)+1))),””),\"\")","v":""},{"$f":"IFERROR(IF($F479>0,$AA479*(1-Settings!$B$3),\"\"),\"\")","v":""},"",null,null,null,null,"","","",0,"",0,0,{"$f":"IF($C479<>\"\",GetStockNumParam($C479,\"h\"),\"\")","v":""},0,"",""]
["",null,null,null,null,null,null,null,null,null,null,"","","","","",{"$f":"IFERROR(IF($F480>0,IF($B$6=\"Canada\",IF($E480=\"CAD\",$F480*((Settings!$B$2)+1),$F480*$E$9*((Settings!$B$2)+1)), IF($E480=\"USD\",$F480*((Settings!$B$2)+1),$F480*$E$9*((Settings!$B$2)+1))),””),\"\")","v":""},{"$f":"IFERROR(IF($F480>0,$AA480*(1-Settings!$B$3),\"\"),\"\")","v":""},"",null,null,null,null,"","","",0,"",0,0,{"$f":"IF($C480<>\"\",GetStockNumParam($C480,\"h\"),\"\")","v":""},0,"",""]
["",null,null,null,null,null,null,null,null,null,null,"","","","","",{"$f":"IFERROR(IF($F481>0,IF($B$6=\"Canada\",IF($E481=\"CAD\",$F481*((Settings!$B$2)+1),$F481*$E$9*((Settings!$B$2)+1)), IF($E481=\"USD\",$F481*((Settings!$B$2)+1),$F481*$E$9*((Settings!$B$2)+1))),””),\"\")","v":""},{"$f":"IFERROR(IF($F481>0,$AA481*(1-Settings!$B$3),\"\"),\"\")","v":""},"",null,null,null,null,"","","",0,"",0,0,{"$f":"IF($C481<>\"\",GetStockNumParam($C481,\"h\"),\"\")","v":""},0,"",""]
["",null,null,null,null,null,null,null,null,null,null,"","","","","",{"$f":"IFERROR(IF($F482>0,IF($B$6=\"Canada\",IF($E482=\"CAD\",$F482*((Settings!$B$2)+1),$F482*$E$9*((Settings!$B$2)+1)), IF($E482=\"USD\",$F482*((Settings!$B$2)+1),$F482*$E$9*((Settings!$B$2)+1))),””),\"\")","v":""},{"$f":"IFERROR(IF($F482>0,$AA482*(1-Settings!$B$3),\"\"),\"\")","v":""},"",null,null,null,null,"","","",0,"",0,0,{"$f":"IF($C482<>\"\",GetStockNumParam($C482,\"h\"),\"\")","v":""},0,"",""]
["",null,null,null,null,null,null,null,null,null,null,"","","","","",{"$f":"IFERROR(IF($F483>0,IF($B$6=\"Canada\",IF($E483=\"CAD\",$F483*((Settings!$B$2)+1),$F483*$E$9*((Settings!$B$2)+1)), IF($E483=\"USD\",$F483*((Settings!$B$2)+1),$F483*$E$9*((Settings!$B$2)+1))),””),\"\")","v":""},{"$f":"IFERROR(IF($F483>0,$AA483*(1-Settings!$B$3),\"\"),\"\")","v":""},"",null,null,null,null,"","","",0,"",0,0,{"$f":"IF($C483<>\"\",GetStockNumParam($C483,\"h\"),\"\")","v":""},0,"",""]
["",null,null,null,null,null,null,null,null,null,null,"","","","","",{"$f":"IFERROR(IF($F484>0,IF($B$6=\"Canada\",IF($E484=\"CAD\",$F484*((Settings!$B$2)+1),$F484*$E$9*((Settings!$B$2)+1)), IF($E484=\"USD\",$F484*((Settings!$B$2)+1),$F484*$E$9*((Settings!$B$2)+1))),””),\"\")","v":""},{"$f":"IFERROR(IF($F484>0,$AA484*(1-Settings!$B$3),\"\"),\"\")","v":""},"",null,null,null,null,"","","",0,"",0,0,{"$f":"IF($C484<>\"\",GetStockNumParam($C484,\"h\"),\"\")","v":""},0,"",""]
["",null,null,null,null,null,null,null,null,null,null,"","","","","",{"$f":"IFERROR(IF($F485>0,IF($B$6=\"Canada\",IF($E485=\"CAD\",$F485*((Settings!$B$2)+1),$F485*$E$9*((Settings!$B$2)+1)), IF($E485=\"USD\",$F485*((Settings!$B$2)+1),$F485*$E$9*((Settings!$B$2)+1))),””),\"\")","v":""},{"$f":"IFERROR(IF($F485>0,$AA485*(1-Settings!$B$3),\"\"),\"\")","v":""},"",null,null,null,null,"","","",0,"",0,0,{"$f":"IF($C485<>\"\",GetStockNumParam($C485,\"h\"),\"\")","v":""},0,"",""]
["",null,null,null,null,null,null,null,null,null,null,"","","","","",{"$f":"IFERROR(IF($F486>0,IF($B$6=\"Canada\",IF($E486=\"CAD\",$F486*((Settings!$B$2)+1),$F486*$E$9*((Settings!$B$2)+1)), IF($E486=\"USD\",$F486*((Settings!$B$2)+1),$F486*$E$9*((Settings!$B$2)+1))),””),\"\")","v":""},{"$f":"IFERROR(IF($F486>0,$AA486*(1-Settings!$B$3),\"\"),\"\")","v":""},"",null,null,null,null,"","","",0,"",0,0,{"$f":"IF($C486<>\"\",GetStockNumParam($C486,\"h\"),\"\")","v":""},0,"",""]
["",null,null,null,null,null,null,null,null,null,null,"","","","","",{"$f":"IFERROR(IF($F487>0,IF($B$6=\"Canada\",IF($E487=\"CAD\",$F487*((Settings!$B$2)+1),$F487*$E$9*((Settings!$B$2)+1)), IF($E487=\"USD\",$F487*((Settings!$B$2)+1),$F487*$E$9*((Settings!$B$2)+1))),””),\"\")","v":""},{"$f":"IFERROR(IF($F487>0,$AA487*(1-Settings!$B$3),\"\"),\"\")","v":""},"",null,null,null,null,"","","",0,"",0,0,{"$f":"IF($C487<>\"\",GetStockNumParam($C487,\"h\"),\"\")","v":""},0,"",""]
["",null,null,null,null,null,null,null,null,null,null,"","","","","",{"$f":"IFERROR(IF($F488>0,IF($B$6=\"Canada\",IF($E488=\"CAD\",$F488*((Settings!$B$2)+1),$F488*$E$9*((Settings!$B$2)+1)), IF($E488=\"USD\",$F488*((Settings!$B$2)+1),$F488*$E$9*((Settings!$B$2)+1))),””),\"\")","v":""},{"$f":"IFERROR(IF($F488>0,$AA488*(1-Settings!$B$3),\"\"),\"\")","v":""},"",null,null,null,null,"","","",0,"",0,0,{"$f":"IF($C488<>\"\",GetStockNumParam($C488,\"h\"),\"\")","v":""},0,"",""]
["",null,null,null,null,null,null,null,null,null,null,"","","","","",{"$f":"IFERROR(IF($F489>0,IF($B$6=\"Canada\",IF($E489=\"CAD\",$F489*((Settings!$B$2)+1),$F489*$E$9*((Settings!$B$2)+1)), IF($E489=\"USD\",$F489*((Settings!$B$2)+1),$F489*$E$9*((Settings!$B$2)+1))),””),\"\")","v":""},{"$f":"IFERROR(IF($F489>0,$AA489*(1-Settings!$B$3),\"\"),\"\")","v":""},"",null,null,null,null,"","","",0,"",0,0,{"$f":"IF($C489<>\"\",GetStockNumParam($C489,\"h\"),\"\")","v":""},0,"",""]
["",null,null,null,null,null,null,null,null,null,null,"","","","","",{"$f":"IFERROR(IF($F490>0,IF($B$6=\"Canada\",IF($E490=\"CAD\",$F490*((Settings!$B$2)+1),$F490*$E$9*((Settings!$B$2)+1)), IF($E490=\"USD\",$F490*((Settings!$B$2)+1),$F490*$E$9*((Settings!$B$2)+1))),””),\"\")","v":""},{"$f":"IFERROR(IF($F490>0,$AA490*(1-Settings!$B$3),\"\"),\"\")","v":""},"",null,null,null,null,"","","",0,"",0,0,{"$f":"IF($C490<>\"\",GetStockNumParam($C490,\"h\"),\"\")","v":""},0,"",""]
["",null,null,null,null,null,null,null,null,null,null,"","","","","",{"$f":"IFERROR(IF($F491>0,IF($B$6=\"Canada\",IF($E491=\"CAD\",$F491*((Settings!$B$2)+1),$F491*$E$9*((Settings!$B$2)+1)), IF($E491=\"USD\",$F491*((Settings!$B$2)+1),$F491*$E$9*((Settings!$B$2)+1))),””),\"\")","v":""},{"$f":"IFERROR(IF($F491>0,$AA491*(1-Settings!$B$3),\"\"),\"\")","v":""},"",null,null,null,null,"","","",0,"",0,0,{"$f":"IF($C491<>\"\",GetStockNumParam($C491,\"h\"),\"\")","v":""},0,"",""]
["",null,null,null,null,null,null,null,null,null,null,"","","","","",{"$f":"IFERROR(IF($F492>0,IF($B$6=\"Canada\",IF($E492=\"CAD\",$F492*((Settings!$B$2)+1),$F492*$E$9*((Settings!$B$2)+1)), IF($E492=\"USD\",$F492*((Settings!$B$2)+1),$F492*$E$9*((Settings!$B$2)+1))),””),\"\")","v":""},{"$f":"IFERROR(IF($F492>0,$AA492*(1-Settings!$B$3),\"\"),\"\")","v":""},"",null,null,null,null,"","","",0,"",0,0,{"$f":"IF($C492<>\"\",GetStockNumParam($C492,\"h\"),\"\")","v":""},0,"",""]
["",null,null,null,null,null,null,null,null,null,null,"","","","","",{"$f":"IFERROR(IF($F493>0,IF($B$6=\"Canada\",IF($E493=\"CAD\",$F493*((Settings!$B$2)+1),$F493*$E$9*((Settings!$B$2)+1)), IF($E493=\"USD\",$F493*((Settings!$B$2)+1),$F493*$E$9*((Settings!$B$2)+1))),””),\"\")","v":""},{"$f":"IFERROR(IF($F493>0,$AA493*(1-Settings!$B$3),\"\"),\"\")","v":""},"",null,null,null,null,"","","",0,"",0,0,{"$f":"IF($C493<>\"\",GetStockNumParam($C493,\"h\"),\"\")","v":""},0,"",""]
["",null,null,null,null,null,null,null,null,null,null,"","","","","",{"$f":"IFERROR(IF($F494>0,IF($B$6=\"Canada\",IF($E494=\"CAD\",$F494*((Settings!$B$2)+1),$F494*$E$9*((Settings!$B$2)+1)), IF($E494=\"USD\",$F494*((Settings!$B$2)+1),$F494*$E$9*((Settings!$B$2)+1))),””),\"\")","v":""},{"$f":"IFERROR(IF($F494>0,$AA494*(1-Settings!$B$3),\"\"),\"\")","v":""},"",null,null,null,null,"","","",0,"",0,0,{"$f":"IF($C494<>\"\",GetStockNumParam($C494,\"h\"),\"\")","v":""},0,"",""]
["",null,null,null,null,null,null,null,null,null,null,"","","","","",{"$f":"IFERROR(IF($F495>0,IF($B$6=\"Canada\",IF($E495=\"CAD\",$F495*((Settings!$B$2)+1),$F495*$E$9*((Settings!$B$2)+1)), IF($E495=\"USD\",$F495*((Settings!$B$2)+1),$F495*$E$9*((Settings!$B$2)+1))),””),\"\")","v":""},{"$f":"IFERROR(IF($F495>0,$AA495*(1-Settings!$B$3),\"\"),\"\")","v":""},"",null,null,null,null,"","","",0,"",0,0,{"$f":"IF($C495<>\"\",GetStockNumParam($C495,\"h\"),\"\")","v":""},0,"",""]
["",null,null,null,null,null,null,null,null,null,null,"","","","","",{"$f":"IFERROR(IF($F496>0,IF($B$6=\"Canada\",IF($E496=\"CAD\",$F496*((Settings!$B$2)+1),$F496*$E$9*((Settings!$B$2)+1)), IF($E496=\"USD\",$F496*((Settings!$B$2)+1),$F496*$E$9*((Settings!$B$2)+1))),””),\"\")","v":""},{"$f":"IFERROR(IF($F496>0,$AA496*(1-Settings!$B$3),\"\"),\"\")","v":""},"",null,null,null,null,"","","",0,"",0,0,{"$f":"IF($C496<>\"\",GetStockNumParam($C496,\"h\"),\"\")","v":""},0,"",""]
["",null,null,null,null,null,null,null,null,null,null,"","","","","",{"$f":"IFERROR(IF($F497>0,IF($B$6=\"Canada\",IF($E497=\"CAD\",$F497*((Settings!$B$2)+1),$F497*$E$9*((Settings!$B$2)+1)), IF($E497=\"USD\",$F497*((Settings!$B$2)+1),$F497*$E$9*((Settings!$B$2)+1))),””),\"\")","v":""},{"$f":"IFERROR(IF($F497>0,$AA497*(1-Settings!$B$3),\"\"),\"\")","v":""},"",null,null,null,null,"","","",0,"",0,0,{"$f":"IF($C497<>\"\",GetStockNumParam($C497,\"h\"),\"\")","v":""},0,"",""]
["",null,null,null,null,null,null,null,null,null,null,"","","","","",{"$f":"IFERROR(IF($F498>0,IF($B$6=\"Canada\",IF($E498=\"CAD\",$F498*((Settings!$B$2)+1),$F498*$E$9*((Settings!$B$2)+1)), IF($E498=\"USD\",$F498*((Settings!$B$2)+1),$F498*$E$9*((Settings!$B$2)+1))),””),\"\")","v":""},{"$f":"IFERROR(IF($F498>0,$AA498*(1-Settings!$B$3),\"\"),\"\")","v":""},"",null,null,null,null,"","","",0,"",0,0,{"$f":"IF($C498<>\"\",GetStockNumParam($C498,\"h\"),\"\")","v":""},0,"",""]
["",null,null,null,null,null,null,null,null,null,null,"","","","","",{"$f":"IFERROR(IF($F499>0,IF($B$6=\"Canada\",IF($E499=\"CAD\",$F499*((Settings!$B$2)+1),$F499*$E$9*((Settings!$B$2)+1)), IF($E499=\"USD\",$F499*((Settings!$B$2)+1),$F499*$E$9*((Settings!$B$2)+1))),””),\"\")","v":""},{"$f":"IFERROR(IF($F499>0,$AA499*(1-Settings!$B$3),\"\"),\"\")","v":""},"",null,null,null,null,"","","",0,"",0,0,{"$f":"IF($C499<>\"\",GetStockNumParam($C499,\"h\"),\"\")","v":""},0,"",""]
["",null,null,null,null,null,null,null,null,null,null,"","","","","",{"$f":"IFERROR(IF($F500>0,IF($B$6=\"Canada\",IF($E500=\"CAD\",$F500*((Settings!$B$2)+1),$F500*$E$9*((Settings!$B$2)+1)), IF($E500=\"USD\",$F500*((Settings!$B$2)+1),$F500*$E$9*((Settings!$B$2)+1))),””),\"\")","v":""},{"$f":"IFERROR(IF($F500>0,$AA500*(1-Settings!$B$3),\"\"),\"\")","v":""},"",null,null,null,null,"","","",0,"",0,0,{"$f":"IF($C500<>\"\",GetStockNumParam($C500,\"h\"),\"\")","v":""},0,"",""]
["",null,null,null,null,null,null,null,null,null,null,"","","","","",{"$f":"IFERROR(IF($F501>0,IF($B$6=\"Canada\",IF($E501=\"CAD\",$F501*((Settings!$B$2)+1),$F501*$E$9*((Settings!$B$2)+1)), IF($E501=\"USD\",$F501*((Settings!$B$2)+1),$F501*$E$9*((Settings!$B$2)+1))),””),\"\")","v":""},{"$f":"IFERROR(IF($F501>0,$AA501*(1-Settings!$B$3),\"\"),\"\")","v":""},"",null,null,null,null,"","","",0,"",0,0,{"$f":"IF($C501<>\"\",GetStockNumParam($C501,\"h\"),\"\")","v":""},0,"",""]
["",null,null,null,null,null,null,null,null,null,null,"","","","","",{"$f":"IFERROR(IF($F502>0,IF($B$6=\"Canada\",IF($E502=\"CAD\",$F502*((Settings!$B$2)+1),$F502*$E$9*((Settings!$B$2)+1)), IF($E502=\"USD\",$F502*((Settings!$B$2)+1),$F502*$E$9*((Settings!$B$2)+1))),””),\"\")","v":""},{"$f":"IFERROR(IF($F502>0,$AA502*(1-Settings!$B$3),\"\"),\"\")","v":""},"",null,null,null,null,"","","",0,"",0,0,{"$f":"IF($C502<>\"\",GetStockNumParam($C502,\"h\"),\"\")","v":""},0,"",""]
["",null,null,null,null,null,null,null,null,null,null,"","","","","",{"$f":"IFERROR(IF($F503>0,IF($B$6=\"Canada\",IF($E503=\"CAD\",$F503*((Settings!$B$2)+1),$F503*$E$9*((Settings!$B$2)+1)), IF($E503=\"USD\",$F503*((Settings!$B$2)+1),$F503*$E$9*((Settings!$B$2)+1))),””),\"\")","v":""},{"$f":"IFERROR(IF($F503>0,$AA503*(1-Settings!$B$3),\"\"),\"\")","v":""},"",null,null,null,null,"","","",0,"",0,0,{"$f":"IF($C503<>\"\",GetStockNumParam($C503,\"h\"),\"\")","v":""},0,"",""]
["",null,null,null,null,null,null,null,null,null,null,"","","","","",{"$f":"IFERROR(IF($F504>0,IF($B$6=\"Canada\",IF($E504=\"CAD\",$F504*((Settings!$B$2)+1),$F504*$E$9*((Settings!$B$2)+1)), IF($E504=\"USD\",$F504*((Settings!$B$2)+1),$F504*$E$9*((Settings!$B$2)+1))),””),\"\")","v":""},{"$f":"IFERROR(IF($F504>0,$AA504*(1-Settings!$B$3),\"\"),\"\")","v":""},"",null,null,null,null,"","","",0,"",0,0,{"$f":"IF($C504<>\"\",GetStockNumParam($C504,\"h\"),\"\")","v":""},0,"",""]
["",null,null,null,null,null,null,null,null,null,null,{"$f":"IF(J505 > 0,K505-J505,\"\")","v":""},{"$f":"IF(J505 > 0,(L505/J505),\"\")","v":""},{"$f":"IF(D505 > 0,IF(T505 > 0,\"SOLD\",D505*K505),\"\")","v":""},{"$f":"IF(D505 > 0,IF(T505 > 0, Z505-I505, N505-I505),\"\")","v":""},{"$f":"IF(D505 > 0,IF(O505=0,0,(O505/I505)),\"\")","v":""},{"$f":"IFERROR(IF($F505>0,IF($B$6=\"Canada\",IF($E505=\"CAD\",$F505*((Settings!$B$2)+1),$F505*$E$9*((Settings!$B$2)+1)), IF($E505=\"USD\",$F505*((Settings!$B$2)+1),$F505*$E$9*((Settings!$B$2)+1))),””),\"\")","v":""},{"$f":"IFERROR(IF($F505>0,$AA505*(1-Settings!$B$3),\"\"),\"\")","v":""},{"$f":"IF(F505>0,IF(K505>=Q505,\"SELL\",IF(K505<=R505,\"STOP\",\"HOLD\")),\"\")","v":""},null,null,null,null,{"$f":"IF(D505 > 0,IF(Z505 = 0,0,Z505-I505),\"\")","v":""},{"$f":"IF(D505 > 0,IF(Z505=0,0,(Z505/I505)-100%),\"\")","v":""},{"$f":"IF(T505 > 0,T505*D505-V505+W505,N505)","v":""},0,"",0,{"$f":"IF(N505 = \"SOLD\", Z505-I505,I505)","v":0},{"$f":"IF($C505<>\"\",GetStockNumParam($C505,\"h\"),\"\")","v":""},0,"",""]
["",null,null,null,null,null,null,null,null,null,null,"","","","","",{"$f":"IFERROR(IF($F506>0,IF($B$6=\"Canada\",IF($E506=\"CAD\",$F506*((Settings!$B$2)+1),$F506*$E$9*((Settings!$B$2)+1)), IF($E506=\"USD\",$F506*((Settings!$B$2)+1),$F506*$E$9*((Settings!$B$2)+1))),””),\"\")","v":""},{"$f":"IFERROR(IF($F506>0,$AA506*(1-Settings!$B$3),\"\"),\"\")","v":""},"",null,null,null,null,"","","",0,"",0,0,{"$f":"IF($C506<>\"\",GetStockNumParam($C506,\"h\"),\"\")","v":""},0,"",""]
["",null,null,null,null,null,null,null,null,null,null,"","","","","",{"$f":"IFERROR(IF($F507>0,IF($B$6=\"Canada\",IF($E507=\"CAD\",$F507*((Settings!$B$2)+1),$F507*$E$9*((Settings!$B$2)+1)), IF($E507=\"USD\",$F507*((Settings!$B$2)+1),$F507*$E$9*((Settings!$B$2)+1))),””),\"\")","v":""},{"$f":"IFERROR(IF($F507>0,$AA507*(1-Settings!$B$3),\"\"),\"\")","v":""},"",null,null,null,null,"","","",0,"",0,0,{"$f":"IF($C507<>\"\",GetStockNumParam($C507,\"h\"),\"\")","v":""},0,"",""]
["",null,null,null,null,null,null,null,null,null,null,"","","","","",{"$f":"IFERROR(IF($F508>0,IF($B$6=\"Canada\",IF($E508=\"CAD\",$F508*((Settings!$B$2)+1),$F508*$E$9*((Settings!$B$2)+1)), IF($E508=\"USD\",$F508*((Settings!$B$2)+1),$F508*$E$9*((Settings!$B$2)+1))),””),\"\")","v":""},{"$f":"IFERROR(IF($F508>0,$AA508*(1-Settings!$B$3),\"\"),\"\")","v":""},"",null,null,null,null,"","","",0,"",0,0,{"$f":"IF($C508<>\"\",GetStockNumParam($C508,\"h\"),\"\")","v":""},0,"",""]
["",null,null,null,null,null,null,null,null,null,null,"","","","","",{"$f":"IFERROR(IF($F509>0,IF($B$6=\"Canada\",IF($E509=\"CAD\",$F509*((Settings!$B$2)+1),$F509*$E$9*((Settings!$B$2)+1)), IF($E509=\"USD\",$F509*((Settings!$B$2)+1),$F509*$E$9*((Settings!$B$2)+1))),””),\"\")","v":""},{"$f":"IFERROR(IF($F509>0,$AA509*(1-Settings!$B$3),\"\"),\"\")","v":""},"",null,null,null,null,"","","",0,"",0,0,{"$f":"IF($C509<>\"\",GetStockNumParam($C509,\"h\"),\"\")","v":""},0,"",""]
["",null,null,null,null,null,null,null,null,null,null,"","","","","",{"$f":"IFERROR(IF($F510>0,IF($B$6=\"Canada\",IF($E510=\"CAD\",$F510*((Settings!$B$2)+1),$F510*$E$9*((Settings!$B$2)+1)), IF($E510=\"USD\",$F510*((Settings!$B$2)+1),$F510*$E$9*((Settings!$B$2)+1))),””),\"\")","v":""},{"$f":"IFERROR(IF($F510>0,$AA510*(1-Settings!$B$3),\"\"),\"\")","v":""},"",null,null,null,null,"","","",0,"",0,0,{"$f":"IF($C510<>\"\",GetStockNumParam($C510,\"h\"),\"\")","v":""},0,"",""]
["",null,null,null,null,null,null,null,null,null,null,"","","","","",{"$f":"IFERROR(IF($F511>0,IF($B$6=\"Canada\",IF($E511=\"CAD\",$F511*((Settings!$B$2)+1),$F511*$E$9*((Settings!$B$2)+1)), IF($E511=\"USD\",$F511*((Settings!$B$2)+1),$F511*$E$9*((Settings!$B$2)+1))),””),\"\")","v":""},{"$f":"IFERROR(IF($F511>0,$AA511*(1-Settings!$B$3),\"\"),\"\")","v":""},"",null,null,null,null,"","","",0,"",0,0,{"$f":"IF($C511<>\"\",GetStockNumParam($C511,\"h\"),\"\")","v":""},0,"",""]

{"sheet":"Charts","index":1,"n_rows":511,"n_cols":10,"rows_kept":511,"cut":false,"hidden":false,"merged":[[0,2,0,6],[0,8,0,9]]}
["Investment Name","Stock Symbol","Display Yahoo Finance Charts in WebPage",null,null,null,null,"StockCharts","Yahoo Finance Quote Info"]
[{"$f":"GetName($B2)","v":"Walt Disney Company (The) Commo\n"},{"$f":"IF(Portfolio!C11=0,\"\",Portfolio!C11)","v":"DIS"},{"$f":"IF($B2<>\"\",HYPERLINK(\"http://ichart.finance.yahoo.com/c/3m/\"&$B2&\"?1234\",\"3m\"),\"\")","v":"3m"},{"$f":"IF($B2<>\"\",HYPERLINK(\"http://ichart.finance.yahoo.com/c/6m/\"&$B2&\"?1234\",\"6m\"),\"\")","v":"6m"},{"$f":"IF($B2<>\"\",HYPERLINK(\"http://ichart.finance.yahoo.com/c/1y/\"&$B2&\"?1234\",\"1y\"),\"\")","v":"1y"},{"$f":"IF($B2<>\"\",HYPERLINK(\"http://ichart.finance.yahoo.com/c/2y/\"&$B2&\"?1234\",\"2y\"),\"\")","v":"2y"},{"$f":"IF($B2<>\"\",HYPERLINK(\"http://ichart.finance.yahoo.com/c/5y/\"&$B2&\"?1234\",\"5y\"),\"\")","v":"5y"},{"$f":"IF($B2<>\"\",HYPERLINK(\"http://stockcharts.com/h-sc/ui?s=\"&$B2,\"6m\"),\"\")","v":"6m"},{"$f":"IF($B2<>\"\",HYPERLINK(\"http://finance.yahoo.com/q?s=\"&$B2&\"&ql=0\", \"News\"),\"\")","v":"News"},{"$f":"IF($B2<>\"\",HYPERLINK(\"http://finance.yahoo.com/q/ks?s=\"&$B2&\"+Key+Statistics\",\"Key Stats\"),\"\")","v":"Key Stats"}]
[{"$f":"GetName($B3)","v":"iShares Nasdaq Biotechnology In\n"},{"$f":"IF(Portfolio!C12=0,\"\",Portfolio!C12)","v":"IBB"},{"$f":"IF($B3<>\"\",HYPERLINK(\"http://ichart.finance.yahoo.com/c/3m/\"&$B3&\"?1234\",\"3m\"),\"\")","v":"3m"},{"$f":"IF($B3<>\"\",HYPERLINK(\"http://ichart.finance.yahoo.com/c/6m/\"&$B3&\"?1234\",\"6m\"),\"\")","v":"6m"},{"$f":"IF($B3<>\"\",HYPERLINK(\"http://ichart.finance.yahoo.com/c/1y/\"&$B3&\"?1234\",\"1y\"),\"\")","v":"1y"},{"$f":"IF($B3<>\"\",HYPERLINK(\"http://ichart.finance.yahoo.com/c/2y/\"&$B3&\"?1234\",\"2y\"),\"\")","v":"2y"},{"$f":"IF($B3<>\"\",HYPERLINK(\"http://ichart.finance.yahoo.com/c/5y/\"&$B3&\"?1234\",\"5y\"),\"\")","v":"5y"},{"$f":"IF($B3<>\"\",HYPERLINK(\"http://stockcharts.com/h-sc/ui?s=\"&$B3,\"6m\"),\"\")","v":"6m"},{"$f":"IF($B3<>\"\",HYPERLINK(\"http://finance.yahoo.com/q?s=\"&$B3&\"&ql=0\", \"News\"),\"\")","v":"News"},{"$f":"IF($B3<>\"\",HYPERLINK(\"http://finance.yahoo.com/q/ks?s=\"&$B3&\"+Key+Statistics\",\"Key Stats\"),\"\")","v":"Key Stats"}]
["BMO EQUAL WEIGHT US BANK IDX ET\n",{"$f":"IF(Portfolio!C13=0,\"\",Portfolio!C13)","v":"ZBK.TO"},"3m","6m","1y","2y","5y","6m","News","Key Stats"]
["Bank of America Corporation Com\n",{"$f":"IF(Portfolio!C14=0,\"\",Portfolio!C14)","v":"BAC"},"3m","6m","1y","2y","5y","6m","News","Key Stats"]
["ELEMENT FLEET MANAGEMENT CORP\n",{"$f":"IF(Portfolio!C15=0,\"\",Portfolio!C15)","v":"EFN.TO"},"3m","6m","1y","2y","5y","6m","News","Key Stats"]
["\n",{"$f":"IF(Portfolio!C16=0,\"\",Portfolio!C16)","v":""},"","","","","","","",""]
["\n",{"$f":"IF(Portfolio!C17=0,\"\",Portfolio!C17)","v":""},"","","","","","","",""]
["CRESCENT POINT ENERGY CORP.\n",{"$f":"IF(Portfolio!C18=0,\"\",Portfolio!C18)","v":"CPG.TO"},"3m","6m","1y","2y","5y","6m","News","Key Stats"]
["DH CORPORATION\n",{"$f":"IF(Portfolio!C19=0,\"\",Portfolio!C19)","v":"DH.TO"},"3m","6m","1y","2y","5y","6m","News","Key Stats"]
["FAIRFAX INDIA HOLDINGS CORPORAT\n",{"$f":"IF(Portfolio!C20=0,\"\",Portfolio!C20)","v":"FIH-U.TO"},"3m","6m","1y","2y","5y","6m","News","Key Stats"]
["Walt Disney Company (The) Commo\n",{"$f":"IF(Portfolio!C21=0,\"\",Portfolio!C21)","v":"DIS"},"3m","6m","1y","2y","5y","6m","News","Key Stats"]
["iShares Nasdaq Biotechnology In\n",{"$f":"IF(Portfolio!C22=0,\"\",Portfolio!C22)","v":"IBB"},"3m","6m","1y","2y","5y","6m","News","Key Stats"]
["BMO EQUAL WEIGHT US BANK IDX ET\n",{"$f":"IF(Portfolio!C23=0,\"\",Portfolio!C23)","v":"ZBK.TO"},"3m","6m","1y","2y","5y","6m","News","Key Stats"]
["Bank of America Corporation Com\n",{"$f":"IF(Portfolio!C24=0,\"\",Portfolio!C24)","v":"BAC"},"3m","6m","1y","2y","5y","6m","News","Key Stats"]
["ELEMENT FLEET MANAGEMENT CORP\n",{"$f":"IF(Portfolio!C25=0,\"\",Portfolio!C25)","v":"EFN.TO"},"3m","6m","1y","2y","5y","6m","News","Key Stats"]
["\n",{"$f":"IF(Portfolio!C26=0,\"\",Portfolio!C26)","v":""},"","","","","","","",""]
["BMO EQUAL WEIGHT US BANK IDX ET\n",{"$f":"IF(Portfolio!C27=0,\"\",Portfolio!C27)","v":"ZBK.TO"},"3m","6m","1y","2y","5y","6m","News","Key Stats"]
["BMO EQL WGT US HCARE HDGD TO CA\n",{"$f":"IF(Portfolio!C28=0,\"\",Portfolio!C28)","v":"ZUH.TO"},"3m","6m","1y","2y","5y","6m","News","Key Stats"]
["ELEMENT FLEET MANAGEMENT CORP\n",{"$f":"IF(Portfolio!C29=0,\"\",Portfolio!C29)","v":"EFN.TO"},"3m","6m","1y","2y","5y","6m","News","Key Stats"]
["\n",{"$f":"IF(Portfolio!C30=0,\"\",Portfolio!C30)","v":""},"","","","","","","",""]
["BOMBARDIER INC., CL. A, MV\n",{"$f":"IF(Portfolio!C31=0,\"\",Portfolio!C31)","v":"BBD-A.TO"},"3m","6m","1y","2y","5y","6m","News","Key Stats"]
["BOMBARDIER INC., CL. B, SV\n",{"$f":"IF(Portfolio!C32=0,\"\",Portfolio!C32)","v":"BBD-B.TO"},"3m","6m","1y","2y","5y","6m","News","Key Stats"]
["SAPUTO INC.\n",{"$f":"IF(Portfolio!C33=0,\"\",Portfolio!C33)","v":"SAP.TO"},"3m","6m","1y","2y","5y","6m","News","Key Stats"]
["TD US Small-Cap Equity - I\n",{"$f":"IF(Portfolio!C34=0,\"\",Portfolio!C34)","v":"TD.TO"},"3m","6m","1y","2y","5y","6m","News","Key Stats"]
["AIRBOSS AMERICA J\n",{"$f":"IF(Portfolio!C35=0,\"\",Portfolio!C35)","v":"BOS.TO"},"3m","6m","1y","2y","5y","6m","News","Key Stats"]
["\n",{"$f":"IF(Portfolio!C36=0,\"\",Portfolio!C36)","v":""},"","","","","","","",""]
["CANADIAN NATIONAL RAILWAY CO.\n",{"$f":"IF(Portfolio!C37=0,\"\",Portfolio!C37)","v":"CNR.TO"},"3m","6m","1y","2y","5y","6m","News","Key Stats"]
["BANK OF NOVA SCOTIA\n",{"$f":"IF(Portfolio!C38=0,\"\",Portfolio!C38)","v":"BNS.TO"},"3m","6m","1y","2y","5y","6m","News","Key Stats"]
["CANADIAN NATIONAL RAILWAY CO.\n",{"$f":"IF(Portfolio!C39=0,\"\",Portfolio!C39)","v":"CNR.TO"},"3m","6m","1y","2y","5y","6m","News","Key Stats"]
["\n",{"$f":"IF(Portfolio!C40=0,\"\",Portfolio!C40)","v":""},"","","","","","","",""]
["\n",{"$f":"IF(Portfolio!C41=0,\"\",Portfolio!C41)","v":""},"","","","","","","",""]
["\n",{"$f":"IF(Portfolio!C42=0,\"\",Portfolio!C42)","v":""},"","","","","","","",""]
["\n",{"$f":"IF(Portfolio!C43=0,\"\",Portfolio!C43)","v":""},"","","","","","","",""]
["BMO INDIA EQUITY INDEX ETF\n",{"$f":"IF(Portfolio!C44=0,\"\",Portfolio!C44)","v":"ZID.TO"},"3m","6m","1y","2y","5y","6m","News","Key Stats"]
["iSHARES SP TSX CAPPED CONS STPL\n",{"$f":"IF(Portfolio!C45=0,\"\",Portfolio!C45)","v":"XST.TO"},"3m","6m","1y","2y","5y","6m","News","Key Stats"]
["QUEBECOR INC., CL.B, SV\n",{"$f":"IF(Portfolio!C46=0,\"\",Portfolio!C46)","v":"QBR-B.TO"},"3m","6m","1y","2y","5y","6m","News","Key Stats"]
["\n",{"$f":"IF(Portfolio!C47=0,\"\",Portfolio!C47)","v":""},"","","","","","","",""]
["\n",{"$f":"IF(Portfolio!C48=0,\"\",Portfolio!C48)","v":""},"","","","","","","",""]
["AMERICAS SILVER CORPORATION\n",{"$f":"IF(Portfolio!C49=0,\"\",Portfolio!C49)","v":"SPM.TO"},"3m","6m","1y","2y","5y","6m","News","Key Stats"]
["GOLDEN ARROW RES CORP.\n",{"$f":"IF(Portfolio!C50=0,\"\",Portfolio!C50)","v":"GRG.V"},"3m","6m","1y","2y","5y","6m","News","Key Stats"]
["YAMANA GOLD INC\n",{"$f":"IF(Portfolio!C51=0,\"\",Portfolio!C51)","v":"YRI.TO"},"3m","6m","1y","2y","5y","6m","News","Key Stats"]
["GOLDCORP INC\n",{"$f":"IF(Portfolio!C52=0,\"\",Portfolio!C52)","v":"G.TO"},"3m","6m","1y","2y","5y","6m","News","Key Stats"]
["BARRICK GOLD CORPORATION\n",{"$f":"IF(Portfolio!C53=0,\"\",Portfolio!C53)","v":"ABX.TO"},"3m","6m","1y","2y","5y","6m","News","Key Stats"]
["KINROSS GOLD CORP.\n",{"$f":"IF(Portfolio!C54=0,\"\",Portfolio!C54)","v":"K.TO"},"3m","6m","1y","2y","5y","6m","News","Key Stats"]
["DETOUR GOLD CORPORATION\n",{"$f":"IF(Portfolio!C55=0,\"\",Portfolio!C55)","v":"DGC.TO"},"3m","6m","1y","2y","5y","6m","News","Key Stats"]
["SILVER WHEATON CORP.\n",{"$f":"IF(Portfolio!C56=0,\"\",Portfolio!C56)","v":"SLW.TO"},"3m","6m","1y","2y","5y","6m","News","Key Stats"]
["TAHOE RESOURCES INC\n",{"$f":"IF(Portfolio!C57=0,\"\",Portfolio!C57)","v":"THO.TO"},"3m","6m","1y","2y","5y","6m","News","Key Stats"]
["PAN AMERICAN J\n",{"$f":"IF(Portfolio!C58=0,\"\",Portfolio!C58)","v":"PAA.TO"},"3m","6m","1y","2y","5y","6m","News","Key Stats"]
["MAG SILVER CORP.\n",{"$f":"IF(Portfolio!C59=0,\"\",Portfolio!C59)","v":"MAG.TO"},"3m","6m","1y","2y","5y","6m","News","Key Stats"]
["GOLDMONEY INC\n",{"$f":"IF(Portfolio!C60=0,\"\",Portfolio!C60)","v":"XAU.V"},"3m","6m","1y","2y","5y","6m","News","Key Stats"]
["\n",{"$f":"IF(Portfolio!C61=0,\"\",Portfolio!C61)","v":""},"","","","","","","",""]
["\n",{"$f":"IF(Portfolio!C62=0,\"\",Portfolio!C62)","v":""},"","","","","","","",""]
["\n",{"$f":"IF(Portfolio!C63=0,\"\",Portfolio!C63)","v":""},"","","","","","","",""]
["\n",{"$f":"IF(Portfolio!C64=0,\"\",Portfolio!C64)","v":""},"","","","","","","",""]
["\n",{"$f":"IF(Portfolio!C65=0,\"\",Portfolio!C65)","v":""},"","","","","","","",""]
["\n",{"$f":"IF(Portfolio!C66=0,\"\",Portfolio!C66)","v":""},"","","","","","","",""]
["\n",{"$f":"IF(Portfolio!C67=0,\"\",Portfolio!C67)","v":""},"","","","","","","",""]
["\n",{"$f":"IF(Portfolio!C68=0,\"\",Portfolio!C68)","v":""},"","","","","","","",""]
["\n",{"$f":"IF(Portfolio!C69=0,\"\",Portfolio!C69)","v":""},"","","","","","","",""]
["\n",{"$f":"IF(Portfolio!C70=0,\"\",Portfolio!C70)","v":""},"","","","","","","",""]
["\n",{"$f":"IF(Portfolio!C71=0,\"\",Portfolio!C71)","v":""},"","","","","","","",""]
["\n",{"$f":"IF(Portfolio!C72=0,\"\",Portfolio!C72)","v":""},"","","","","","","",""]
["\n",{"$f":"IF(Portfolio!C73=0,\"\",Portfolio!C73)","v":""},"","","","","","","",""]
["\n",{"$f":"IF(Portfolio!C74=0,\"\",Portfolio!C74)","v":""},"","","","","","","",""]
["\n",{"$f":"IF(Portfolio!C75=0,\"\",Portfolio!C75)","v":""},"","","","","","","",""]
[{"$f":"GetName($B67)","v":"\n"},{"$f":"IF(Portfolio!C76=0,\"\",Portfolio!C76)","v":""},{"$f":"IF($B67<>\"\",HYPERLINK(\"http://ichart.finance.yahoo.com/c/3m/\"&$B67&\"?1234\",\"3m\"),\"\")","v":""},{"$f":"IF($B67<>\"\",HYPERLINK(\"http://ichart.finance.yahoo.com/c/6m/\"&$B67&\"?1234\",\"6m\"),\"\")","v":""},{"$f":"IF($B67<>\"\",HYPERLINK(\"http://ichart.finance.yahoo.com/c/1y/\"&$B67&\"?1234\",\"1y\"),\"\")","v":""},{"$f":"IF($B67<>\"\",HYPERLINK(\"http://ichart.finance.yahoo.com/c/2y/\"&$B67&\"?1234\",\"2y\"),\"\")","v":""},{"$f":"IF($B67<>\"\",HYPERLINK(\"http://ichart.finance.yahoo.com/c/5y/\"&$B67&\"?1234\",\"5y\"),\"\")","v":""},{"$f":"IF($B67<>\"\",HYPERLINK(\"http://stockcharts.com/h-sc/ui?s=\"&$B67,\"6m\"),\"\")","v":""},{"$f":"IF($B67<>\"\",HYPERLINK(\"http://finance.yahoo.com/q?s=\"&$B67&\"&ql=0\", \"News\"),\"\")","v":""},{"$f":"IF($B67<>\"\",HYPERLINK(\"http://finance.yahoo.com/q/ks?s=\"&$B67&\"+Key+Statistics\",\"Key Stats\"),\"\")","v":""}]
["\n",{"$f":"IF(Portfolio!C77=0,\"\",Portfolio!C77)","v":""},"","","","","","","",""]
["\n",{"$f":"IF(Portfolio!C78=0,\"\",Portfolio!C78)","v":""},"","","","","","","",""]
["\n",{"$f":"IF(Portfolio!C79=0,\"\",Portfolio!C79)","v":""},"","","","","","","",""]
["\n",{"$f":"IF(Portfolio!C80=0,\"\",Portfolio!C80)","v":""},"","","","","","","",""]
["\n",{"$f":"IF(Portfolio!C81=0,\"\",Portfolio!C81)","v":""},"","","","","","","",""]
["\n",{"$f":"IF(Portfolio!C82=0,\"\",Portfolio!C82)","v":""},"","","","","","","",""]
["\n",{"$f":"IF(Portfolio!C83=0,\"\",Portfolio!C83)","v":""},"","","","","","","",""]
["\n",{"$f":"IF(Portfolio!C84=0,\"\",Portfolio!C84)","v":""},"","","","","","","",""]
["\n",{"$f":"IF(Portfolio!C85=0,\"\",Portfolio!C85)","v":""},"","","","","","","",""]
["\n",{"$f":"IF(Portfolio!C86=0,\"\",Portfolio!C86)","v":""},"","","","","","","",""]
["\n",{"$f":"IF(Portfolio!C87=0,\"\",Portfolio!C87)","v":""},"","","","","","","",""]
["\n",{"$f":"IF(Portfolio!C88=0,\"\",Portfolio!C88)","v":""},"","","","","","","",""]
["\n",{"$f":"IF(Portfolio!C89=0,\"\",Portfolio!C89)","v":""},"","","","","","","",""]
["\n",{"$f":"IF(Portfolio!C90=0,\"\",Portfolio!C90)","v":""},"","","","","","","",""]
["\n",{"$f":"IF(Portfolio!C91=0,\"\",Portfolio!C91)","v":""},"","","","","","","",""]
["\n",{"$f":"IF(Portfolio!C92=0,\"\",Portfolio!C92)","v":""},"","","","","","","",""]
["\n",{"$f":"IF(Portfolio!C93=0,\"\",Portfolio!C93)","v":""},"","","","","","","",""]
["\n",{"$f":"IF(Portfolio!C94=0,\"\",Portfolio!C94)","v":""},"","","","","","","",""]
["\n",{"$f":"IF(Portfolio!C95=0,\"\",Portfolio!C95)","v":""},"","","","","","","",""]
["\n",{"$f":"IF(Portfolio!C96=0,\"\",Portfolio!C96)","v":""},"","","","","","","",""]
["\n",{"$f":"IF(Portfolio!C97=0,\"\",Portfolio!C97)","v":""},"","","","","","","",""]
["\n",{"$f":"IF(Portfolio!C98=0,\"\",Portfolio!C98)","v":""},"","","","","","","",""]
["\n",{"$f":"IF(Portfolio!C99=0,\"\",Portfolio!C99)","v":""},"","","","","","","",""]
["\n",{"$f":"IF(Portfolio!C100=0,\"\",Portfolio!C100)","v":""},"","","","","","","",""]
["\n",{"$f":"IF(Portfolio!C101=0,\"\",Portfolio!C101)","v":""},"","","","","","","",""]
["\n",{"$f":"IF(Portfolio!C102=0,\"\",Portfolio!C102)","v":""},"","","","","","","",""]
["\n",{"$f":"IF(Portfolio!C103=0,\"\",Portfolio!C103)","v":""},"","","","","","","",""]
["\n",{"$f":"IF(Portfolio!C104=0,\"\",Portfolio!C104)","v":""},"","","","","","","",""]
["\n",{"$f":"IF(Portfolio!C105=0,\"\",Portfolio!C105)","v":""},"","","","","","","",""]
["\n",{"$f":"IF(Portfolio!C106=0,\"\",Portfolio!C106)","v":""},"","","","","","","",""]
["\n",{"$f":"IF(Portfolio!C107=0,\"\",Portfolio!C107)","v":""},"","","","","","","",""]
["\n",{"$f":"IF(Portfolio!C108=0,\"\",Portfolio!C108)","v":""},"","","","","","","",""]
["\n",{"$f":"IF(Portfolio!C109=0,\"\",Portfolio!C109)","v":""},"","","","","","","",""]
["\n",{"$f":"IF(Portfolio!C110=0,\"\",Portfolio!C110)","v":""},"","","","","","","",""]
["\n",{"$f":"IF(Portfolio!C111=0,\"\",Portfolio!C111)","v":""},"","","","","","","",""]
["\n",{"$f":"IF(Portfolio!C112=0,\"\",Portfolio!C112)","v":""},"","","","","","","",""]
["\n",{"$f":"IF(Portfolio!C113=0,\"\",Portfolio!C113)","v":""},"","","","","","","",""]
["\n",{"$f":"IF(Portfolio!C114=0,\"\",Portfolio!C114)","v":""},"","","","","","","",""]
["\n",{"$f":"IF(Portfolio!C115=0,\"\",Portfolio!C115)","v":""},"","","","","","","",""]
["\n",{"$f":"IF(Portfolio!C116=0,\"\",Portfolio!C116)","v":""},"","","","","","","",""]
["\n",{"$f":"IF(Portfolio!C117=0,\"\",Portfolio!C117)","v":""},"","","","","","","",""]
["\n",{"$f":"IF(Portfolio!C118=0,\"\",Portfolio!C118)","v":""},"","","","","","","",""]
["\n",{"$f":"IF(Portfolio!C119=0,\"\",Portfolio!C119)","v":""},"","","","","","","",""]
["\n",{"$f":"IF(Portfolio!C120=0,\"\",Portfolio!C120)","v":""},"","","","","","","",""]
["\n",{"$f":"IF(Portfolio!C121=0,\"\",Portfolio!C121)","v":""},"","","","","","","",""]
["\n",{"$f":"IF(Portfolio!C122=0,\"\",Portfolio!C122)","v":""},"","","","","","","",""]
["\n",{"$f":"IF(Portfolio!C123=0,\"\",Portfolio!C123)","v":""},"","","","","","","",""]
["\n",{"$f":"IF(Portfolio!C124=0,\"\",Portfolio!C124)","v":""},"","","","","","","",""]
["\n",{"$f":"IF(Portfolio!C125=0,\"\",Portfolio!C125)","v":""},"","","","","","","",""]
["\n",{"$f":"IF(Portfolio!C126=0,\"\",Portfolio!C126)","v":""},"","","","","","","",""]
["\n",{"$f":"IF(Portfolio!C127=0,\"\",Portfolio!C127)","v":""},"","","","","","","",""]
["\n",{"$f":"IF(Portfolio!C128=0,\"\",Portfolio!C128)","v":""},"","","","","","","",""]
["\n",{"$f":"IF(Portfolio!C129=0,\"\",Portfolio!C129)","v":""},"","","","","","","",""]
["\n",{"$f":"IF(Portfolio!C130=0,\"\",Portfolio!C130)","v":""},"","","","","","","",""]
["\n",{"$f":"IF(Portfolio!C131=0,\"\",Portfolio!C131)","v":""},"","","","","","","",""]
["\n",{"$f":"IF(Portfolio!C132=0,\"\",Portfolio!C132)","v":""},"","","","","","","",""]
["\n",{"$f":"IF(Portfolio!C133=0,\"\",Portfolio!C133)","v":""},"","","","","","","",""]
["\n",{"$f":"IF(Portfolio!C134=0,\"\",Portfolio!C134)","v":""},"","","","","","","",""]
["\n",{"$f":"IF(Portfolio!C135=0,\"\",Portfolio!C135)","v":""},"","","","","","","",""]
["\n",{"$f":"IF(Portfolio!C136=0,\"\",Portfolio!C136)","v":""},"","","","","","","",""]
["\n",{"$f":"IF(Portfolio!C137=0,\"\",Portfolio!C137)","v":""},"","","","","","","",""]
["\n",{"$f":"IF(Portfolio!C138=0,\"\",Portfolio!C138)","v":""},"","","","","","","",""]
["\n",{"$f":"IF(Portfolio!C139=0,\"\",Portfolio!C139)","v":""},"","","","","","","",""]
[{"$f":"GetName($B131)","v":"\n"},{"$f":"IF(Portfolio!C140=0,\"\",Portfolio!C140)","v":""},{"$f":"IF($B131<>\"\",HYPERLINK(\"http://ichart.finance.yahoo.com/c/3m/\"&$B131&\"?1234\",\"3m\"),\"\")","v":""},{"$f":"IF($B131<>\"\",HYPERLINK(\"http://ichart.finance.yahoo.com/c/6m/\"&$B131&\"?1234\",\"6m\"),\"\")","v":""},{"$f":"IF($B131<>\"\",HYPERLINK(\"http://ichart.finance.yahoo.com/c/1y/\"&$B131&\"?1234\",\"1y\"),\"\")","v":""},{"$f":"IF($B131<>\"\",HYPERLINK(\"http://ichart.finance.yahoo.com/c/2y/\"&$B131&\"?1234\",\"2y\"),\"\")","v":""},{"$f":"IF($B131<>\"\",HYPERLINK(\"http://ichart.finance.yahoo.com/c/5y/\"&$B131&\"?1234\",\"5y\"),\"\")","v":""},{"$f":"IF($B131<>\"\",HYPERLINK(\"http://stockcharts.com/h-sc/ui?s=\"&$B131,\"6m\"),\"\")","v":""},{"$f":"IF($B131<>\"\",HYPERLINK(\"http://finance.yahoo.com/q?s=\"&$B131&\"&ql=0\", \"News\"),\"\")","v":""},{"$f":"IF($B131<>\"\",HYPERLINK(\"http://finance.yahoo.com/q/ks?s=\"&$B131&\"+Key+Statistics\",\"Key Stats\"),\"\")","v":""}]
["\n",{"$f":"IF(Portfolio!C141=0,\"\",Portfolio!C141)","v":""},"","","","","","","",""]
["\n",{"$f":"IF(Portfolio!C142=0,\"\",Portfolio!C142)","v":""},"","","","","","","",""]
["\n",{"$f":"IF(Portfolio!C143=0,\"\",Portfolio!C143)","v":""},"","","","","","","",""]
["\n",{"$f":"IF(Portfolio!C144=0,\"\",Portfolio!C144)","v":""},"","","","","","","",""]
["\n",{"$f":"IF(Portfolio!C145=0,\"\",Portfolio!C145)","v":""},"","","","","","","",""]
["\n",{"$f":"IF(Portfolio!C146=0,\"\",Portfolio!C146)","v":""},"","","","","","","",""]
["\n",{"$f":"IF(Portfolio!C147=0,\"\",Portfolio!C147)","v":""},"","","","","","","",""]
["\n",{"$f":"IF(Portfolio!C148=0,\"\",Portfolio!C148)","v":""},"","","","","","","",""]
["\n",{"$f":"IF(Portfolio!C149=0,\"\",Portfolio!C149)","v":""},"","","","","","","",""]
["\n",{"$f":"IF(Portfolio!C150=0,\"\",Portfolio!C150)","v":""},"","","","","","","",""]
["\n",{"$f":"IF(Portfolio!C151=0,\"\",Portfolio!C151)","v":""},"","","","","","","",""]
["\n",{"$f":"IF(Portfolio!C152=0,\"\",Portfolio!C152)","v":""},"","","","","","","",""]
["\n",{"$f":"IF(Portfolio!C153=0,\"\",Portfolio!C153)","v":""},"","","","","","","",""]
["\n",{"$f":"IF(Portfolio!C154=0,\"\",Portfolio!C154)","v":""},"","","","","","","",""]
["\n",{"$f":"IF(Portfolio!C155=0,\"\",Portfolio!C155)","v":""},"","","","","","","",""]
["\n",{"$f":"IF(Portfolio!C156=0,\"\",Portfolio!C156)","v":""},"","","","","","","",""]
["\n",{"$f":"IF(Portfolio!C157=0,\"\",Portfolio!C157)","v":""},"","","","","","","",""]
["\n",{"$f":"IF(Portfolio!C158=0,\"\",Portfolio!C158)","v":""},"","","","","","","",""]
["\n",{"$f":"IF(Portfolio!C159=0,\"\",Portfolio!C159)","v":""},"","","","","","","",""]
["\n",{"$f":"IF(Portfolio!C160=0,\"\",Portfolio!C160)","v":""},"","","","","","","",""]
["\n",{"$f":"IF(Portfolio!C161=0,\"\",Portfolio!C161)","v":""},"","","","","","","",""]
["\n",{"$f":"IF(Portfolio!C162=0,\"\",Portfolio!C162)","v":""},"","","","","","","",""]
["\n",{"$f":"IF(Portfolio!C163=0,\"\",Portfolio!C163)","v":""},"","","","","","","",""]
["\n",{"$f":"IF(Portfolio!C164=0,\"\",Portfolio!C164)","v":""},"","","","","","","",""]
["\n",{"$f":"IF(Portfolio!C165=0,\"\",Portfolio!C165)","v":""},"","","","","","","",""]
["\n",{"$f":"IF(Portfolio!C166=0,\"\",Portfolio!C166)","v":""},"","","","","","","",""]
["\n",{"$f":"IF(Portfolio!C167=0,\"\",Portfolio!C167)","v":""},"","","","","","","",""]
["\n",{"$f":"IF(Portfolio!C168=0,\"\",Portfolio!C168)","v":""},"","","","","","","",""]
["\n",{"$f":"IF(Portfolio!C169=0,\"\",Portfolio!C169)","v":""},"","","","","","","",""]
["\n",{"$f":"IF(Portfolio!C170=0,\"\",Portfolio!C170)","v":""},"","","","","","","",""]
["\n",{"$f":"IF(Portfolio!C171=0,\"\",Portfolio!C171)","v":""},"","","","","","","",""]
["\n",{"$f":"IF(Portfolio!C172=0,\"\",Portfolio!C172)","v":""},"","","","","","","",""]
["\n",{"$f":"IF(Portfolio!C173=0,\"\",Portfolio!C173)","v":""},"","","","","","","",""]
["\n",{"$f":"IF(Portfolio!C174=0,\"\",Portfolio!C174)","v":""},"","","","","","","",""]
["\n",{"$f":"IF(Portfolio!C175=0,\"\",Portfolio!C175)","v":""},"","","","","","","",""]
["\n",{"$f":"IF(Portfolio!C176=0,\"\",Portfolio!C176)","v":""},"","","","","","","",""]
["\n",{"$f":"IF(Portfolio!C177=0,\"\",Portfolio!C177)","v":""},"","","","","","","",""]
["\n",{"$f":"IF(Portfolio!C178=0,\"\",Portfolio!C178)","v":""},"","","","","","","",""]
["\n",{"$f":"IF(Portfolio!C179=0,\"\",Portfolio!C179)","v":""},"","","","","","","",""]
["\n",{"$f":"IF(Portfolio!C180=0,\"\",Portfolio!C180)","v":""},"","","","","","","",""]
["\n",{"$f":"IF(Portfolio!C181=0,\"\",Portfolio!C181)","v":""},"","","","","","","",""]
["\n",{"$f":"IF(Portfolio!C182=0,\"\",Portfolio!C182)","v":""},"","","","","","","",""]
["\n",{"$f":"IF(Portfolio!C183=0,\"\",Portfolio!C183)","v":""},"","","","","","","",""]
["\n",{"$f":"IF(Portfolio!C184=0,\"\",Portfolio!C184)","v":""},"","","","","","","",""]
["\n",{"$f":"IF(Portfolio!C185=0,\"\",Portfolio!C185)","v":""},"","","","","","","",""]
["\n",{"$f":"IF(Portfolio!C186=0,\"\",Portfolio!C186)","v":""},"","","","","","","",""]
["\n",{"$f":"IF(Portfolio!C187=0,\"\",Portfolio!C187)","v":""},"","","","","","","",""]
["\n",{"$f":"IF(Portfolio!C188=0,\"\",Portfolio!C188)","v":""},"","","","","","","",""]
["\n",{"$f":"IF(Portfolio!C189=0,\"\",Portfolio!C189)","v":""},"","","","","","","",""]
["\n",{"$f":"IF(Portfolio!C190=0,\"\",Portfolio!C190)","v":""},"","","","","","","",""]
["\n",{"$f":"IF(Portfolio!C191=0,\"\",Portfolio!C191)","v":""},"","","","","","","",""]
["\n",{"$f":"IF(Portfolio!C192=0,\"\",Portfolio!C192)","v":""},"","","","","","","",""]
["\n",{"$f":"IF(Portfolio!C193=0,\"\",Portfolio!C193)","v":""},"","","","","","","",""]
["\n",{"$f":"IF(Portfolio!C194=0,\"\",Portfolio!C194)","v":""},"","","","","","","",""]
["\n",{"$f":"IF(Portfolio!C195=0,\"\",Portfolio!C195)","v":""},"","","","","","","",""]
["\n",{"$f":"IF(Portfolio!C196=0,\"\",Portfolio!C196)","v":""},"","","","","","","",""]
["\n",{"$f":"IF(Portfolio!C197=0,\"\",Portfolio!C197)","v":""},"","","","","","","",""]
["\n",{"$f":"IF(Portfolio!C198=0,\"\",Portfolio!C198)","v":""},"","","","","","","",""]
["\n",{"$f":"IF(Portfolio!C199=0,\"\",Portfolio!C199)","v":""},"","","","","","","",""]
["\n",{"$f":"IF(Portfolio!C200=0,\"\",Portfolio!C200)","v":""},"","","","","","","",""]
["\n",{"$f":"IF(Portfolio!C201=0,\"\",Portfolio!C201)","v":""},"","","","","","","",""]
["\n",{"$f":"IF(Portfolio!C202=0,\"\",Portfolio!C202)","v":""},"","","","","","","",""]
["\n",{"$f":"IF(Portfolio!C203=0,\"\",Portfolio!C203)","v":""},"","","","","","","",""]
[{"$f":"GetName($B195)","v":"\n"},{"$f":"IF(Portfolio!C204=0,\"\",Portfolio!C204)","v":""},{"$f":"IF($B195<>\"\",HYPERLINK(\"http://ichart.finance.yahoo.com/c/3m/\"&$B195&\"?1234\",\"3m\"),\"\")","v":""},{"$f":"IF($B195<>\"\",HYPERLINK(\"http://ichart.finance.yahoo.com/c/6m/\"&$B195&\"?1234\",\"6m\"),\"\")","v":""},{"$f":"IF($B195<>\"\",HYPERLINK(\"http://ichart.finance.yahoo.com/c/1y/\"&$B195&\"?1234\",\"1y\"),\"\")","v":""},{"$f":"IF($B195<>\"\",HYPERLINK(\"http://ichart.finance.yahoo.com/c/2y/\"&$B195&\"?1234\",\"2y\"),\"\")","v":""},{"$f":"IF($B195<>\"\",HYPERLINK(\"http://ichart.finance.yahoo.com/c/5y/\"&$B195&\"?1234\",\"5y\"),\"\")","v":""},{"$f":"IF($B195<>\"\",HYPERLINK(\"http://stockcharts.com/h-sc/ui?s=\"&$B195,\"6m\"),\"\")","v":""},{"$f":"IF($B195<>\"\",HYPERLINK(\"http://finance.yahoo.com/q?s=\"&$B195&\"&ql=0\", \"News\"),\"\")","v":""},{"$f":"IF($B195<>\"\",HYPERLINK(\"http://finance.yahoo.com/q/ks?s=\"&$B195&\"+Key+Statistics\",\"Key Stats\"),\"\")","v":""}]
["\n",{"$f":"IF(Portfolio!C205=0,\"\",Portfolio!C205)","v":""},"","","","","","","",""]
["\n",{"$f":"IF(Portfolio!C206=0,\"\",Portfolio!C206)","v":""},"","","","","","","",""]
["\n",{"$f":"IF(Portfolio!C207=0,\"\",Portfolio!C207)","v":""},"","","","","","","",""]
["\n",{"$f":"IF(Portfolio!C208=0,\"\",Portfolio!C208)","v":""},"","","","","","","",""]
["\n",{"$f":"IF(Portfolio!C209=0,\"\",Portfolio!C209)","v":""},"","","","","","","",""]
["\n",{"$f":"IF(Portfolio!C210=0,\"\",Portfolio!C210)","v":""},"","","","","","","",""]
["\n",{"$f":"IF(Portfolio!C211=0,\"\",Portfolio!C211)","v":""},"","","","","","","",""]
["\n",{"$f":"IF(Portfolio!C212=0,\"\",Portfolio!C212)","v":""},"","","","","","","",""]
["\n",{"$f":"IF(Portfolio!C213=0,\"\",Portfolio!C213)","v":""},"","","","","","","",""]
["\n",{"$f":"IF(Portfolio!C214=0,\"\",Portfolio!C214)","v":""},"","","","","","","",""]
["\n",{"$f":"IF(Portfolio!C215=0,\"\",Portfolio!C215)","v":""},"","","","","","","",""]
["\n",{"$f":"IF(Portfolio!C216=0,\"\",Portfolio!C216)","v":""},"","","","","","","",""]
["\n",{"$f":"IF(Portfolio!C217=0,\"\",Portfolio!C217)","v":""},"","","","","","","",""]
["\n",{"$f":"IF(Portfolio!C218=0,\"\",Portfolio!C218)","v":""},"","","","","","","",""]
["\n",{"$f":"IF(Portfolio!C219=0,\"\",Portfolio!C219)","v":""},"","","","","","","",""]
["\n",{"$f":"IF(Portfolio!C220=0,\"\",Portfolio!C220)","v":""},"","","","","","","",""]
["\n",{"$f":"IF(Portfolio!C221=0,\"\",Portfolio!C221)","v":""},"","","","","","","",""]
["\n",{"$f":"IF(Portfolio!C222=0,\"\",Portfolio!C222)","v":""},"","","","","","","",""]
["\n",{"$f":"IF(Portfolio!C223=0,\"\",Portfolio!C223)","v":""},"","","","","","","",""]
["\n",{"$f":"IF(Portfolio!C224=0,\"\",Portfolio!C224)","v":""},"","","","","","","",""]
["\n",{"$f":"IF(Portfolio!C225=0,\"\",Portfolio!C225)","v":""},"","","","","","","",""]
["\n",{"$f":"IF(Portfolio!C226=0,\"\",Portfolio!C226)","v":""},"","","","","","","",""]
["\n",{"$f":"IF(Portfolio!C227=0,\"\",Portfolio!C227)","v":""},"","","","","","","",""]
["\n",{"$f":"IF(Portfolio!C228=0,\"\",Portfolio!C228)","v":""},"","","","","","","",""]
["\n",{"$f":"IF(Portfolio!C229=0,\"\",Portfolio!C229)","v":""},"","","","","","","",""]
["\n",{"$f":"IF(Portfolio!C230=0,\"\",Portfolio!C230)","v":""},"","","","","","","",""]
["\n",{"$f":"IF(Portfolio!C231=0,\"\",Portfolio!C231)","v":""},"","","","","","","",""]
["\n",{"$f":"IF(Portfolio!C232=0,\"\",Portfolio!C232)","v":""},"","","","","","","",""]
["\n",{"$f":"IF(Portfolio!C233=0,\"\",Portfolio!C233)","v":""},"","","","","","","",""]
["\n",{"$f":"IF(Portfolio!C234=0,\"\",Portfolio!C234)","v":""},"","","","","","","",""]
["\n",{"$f":"IF(Portfolio!C235=0,\"\",Portfolio!C235)","v":""},"","","","","","","",""]
["\n",{"$f":"IF(Portfolio!C236=0,\"\",Portfolio!C236)","v":""},"","","","","","","",""]
["\n",{"$f":"IF(Portfolio!C237=0,\"\",Portfolio!C237)","v":""},"","","","","","","",""]
["\n",{"$f":"IF(Portfolio!C238=0,\"\",Portfolio!C238)","v":""},"","","","","","","",""]
["\n",{"$f":"IF(Portfolio!C239=0,\"\",Portfolio!C239)","v":""},"","","","","","","",""]
["\n",{"$f":"IF(Portfolio!C240=0,\"\",Portfolio!C240)","v":""},"","","","","","","",""]
["\n",{"$f":"IF(Portfolio!C241=0,\"\",Portfolio!C241)","v":""},"","","","","","","",""]
["\n",{"$f":"IF(Portfolio!C242=0,\"\",Portfolio!C242)","v":""},"","","","","","","",""]
["\n",{"$f":"IF(Portfolio!C243=0,\"\",Portfolio!C243)","v":""},"","","","","","","",""]
["\n",{"$f":"IF(Portfolio!C244=0,\"\",Portfolio!C244)","v":""},"","","","","","","",""]
["\n",{"$f":"IF(Portfolio!C245=0,\"\",Portfolio!C245)","v":""},"","","","","","","",""]
["\n",{"$f":"IF(Portfolio!C246=0,\"\",Portfolio!C246)","v":""},"","","","","","","",""]
["\n",{"$f":"IF(Portfolio!C247=0,\"\",Portfolio!C247)","v":""},"","","","","","","",""]
["\n",{"$f":"IF(Portfolio!C248=0,\"\",Portfolio!C248)","v":""},"","","","","","","",""]
["\n",{"$f":"IF(Portfolio!C249=0,\"\",Portfolio!C249)","v":""},"","","","","","","",""]
["\n",{"$f":"IF(Portfolio!C250=0,\"\",Portfolio!C250)","v":""},"","","","","","","",""]
["\n",{"$f":"IF(Portfolio!C251=0,\"\",Portfolio!C251)","v":""},"","","","","","","",""]
["\n",{"$f":"IF(Portfolio!C252=0,\"\",Portfolio!C252)","v":""},"","","","","","","",""]
["\n",{"$f":"IF(Portfolio!C253=0,\"\",Portfolio!C253)","v":""},"","","","","","","",""]
["\n",{"$f":"IF(Portfolio!C254=0,\"\",Portfolio!C254)","v":""},"","","","","","","",""]
["\n",{"$f":"IF(Portfolio!C255=0,\"\",Portfolio!C255)","v":""},"","","","","","","",""]
["\n",{"$f":"IF(Portfolio!C256=0,\"\",Portfolio!C256)","v":""},"","","","","","","",""]
["\n",{"$f":"IF(Portfolio!C257=0,\"\",Portfolio!C257)","v":""},"","","","","","","",""]
["\n",{"$f":"IF(Portfolio!C258=0,\"\",Portfolio!C258)","v":""},"","","","","","","",""]
["\n",{"$f":"IF(Portfolio!C259=0,\"\",Portfolio!C259)","v":""},"","","","","","","",""]
["\n",{"$f":"IF(Portfolio!C260=0,\"\",Portfolio!C260)","v":""},"","","","","","","",""]
["\n",{"$f":"IF(Portfolio!C261=0,\"\",Portfolio!C261)","v":""},"","","","","","","",""]
["\n",{"$f":"IF(Portfolio!C262=0,\"\",Portfolio!C262)","v":""},"","","","","","","",""]
["\n",{"$f":"IF(Portfolio!C263=0,\"\",Portfolio!C263)","v":""},"","","","","","","",""]
["\n",{"$f":"IF(Portfolio!C264=0,\"\",Portfolio!C264)","v":""},"","","","","","","",""]
["\n",{"$f":"IF(Portfolio!C265=0,\"\",Portfolio!C265)","v":""},"","","","","","","",""]
["\n",{"$f":"IF(Portfolio!C266=0,\"\",Portfolio!C266)","v":""},"","","","","","","",""]
["\n",{"$f":"IF(Portfolio!C267=0,\"\",Portfolio!C267)","v":""},"","","","","","","",""]
[{"$f":"GetName($B259)","v":"\n"},{"$f":"IF(Portfolio!C268=0,\"\",Portfolio!C268)","v":""},{"$f":"IF($B259<>\"\",HYPERLINK(\"http://ichart.finance.yahoo.com/c/3m/\"&$B259&\"?1234\",\"3m\"),\"\")","v":""},{"$f":"IF($B259<>\"\",HYPERLINK(\"http://ichart.finance.yahoo.com/c/6m/\"&$B259&\"?1234\",\"6m\"),\"\")","v":""},{"$f":"IF($B259<>\"\",HYPERLINK(\"http://ichart.finance.yahoo.com/c/1y/\"&$B259&\"?1234\",\"1y\"),\"\")","v":""},{"$f":"IF($B259<>\"\",HYPERLINK(\"http://ichart.finance.yahoo.com/c/2y/\"&$B259&\"?1234\",\"2y\"),\"\")","v":""},{"$f":"IF($B259<>\"\",HYPERLINK(\"http://ichart.finance.yahoo.com/c/5y/\"&$B259&\"?1234\",\"5y\"),\"\")","v":""},{"$f":"IF($B259<>\"\",HYPERLINK(\"http://stockcharts.com/h-sc/ui?s=\"&$B259,\"6m\"),\"\")","v":""},{"$f":"IF($B259<>\"\",HYPERLINK(\"http://finance.yahoo.com/q?s=\"&$B259&\"&ql=0\", \"News\"),\"\")","v":""},{"$f":"IF($B259<>\"\",HYPERLINK(\"http://finance.yahoo.com/q/ks?s=\"&$B259&\"+Key+Statistics\",\"Key Stats\"),\"\")","v":""}]
["\n",{"$f":"IF(Portfolio!C269=0,\"\",Portfolio!C269)","v":""},"","","","","","","",""]
["\n",{"$f":"IF(Portfolio!C270=0,\"\",Portfolio!C270)","v":""},"","","","","","","",""]
["\n",{"$f":"IF(Portfolio!C271=0,\"\",Portfolio!C271)","v":""},"","","","","","","",""]
["\n",{"$f":"IF(Portfolio!C272=0,\"\",Portfolio!C272)","v":""},"","","","","","","",""]
["\n",{"$f":"IF(Portfolio!C273=0,\"\",Portfolio!C273)","v":""},"","","","","","","",""]
["\n",{"$f":"IF(Portfolio!C274=0,\"\",Portfolio!C274)","v":""},"","","","","","","",""]
["\n",{"$f":"IF(Portfolio!C275=0,\"\",Portfolio!C275)","v":""},"","","","","","","",""]
["\n",{"$f":"IF(Portfolio!C276=0,\"\",Portfolio!C276)","v":""},"","","","","","","",""]
["\n",{"$f":"IF(Portfolio!C277=0,\"\",Portfolio!C277)","v":""},"","","","","","","",""]
["\n",{"$f":"IF(Portfolio!C278=0,\"\",Portfolio!C278)","v":""},"","","","","","","",""]
["\n",{"$f":"IF(Portfolio!C279=0,\"\",Portfolio!C279)","v":""},"","","","","","","",""]
["\n",{"$f":"IF(Portfolio!C280=0,\"\",Portfolio!C280)","v":""},"","","","","","","",""]
["\n",{"$f":"IF(Portfolio!C281=0,\"\",Portfolio!C281)","v":""},"","","","","","","",""]
["\n",{"$f":"IF(Portfolio!C282=0,\"\",Portfolio!C282)","v":""},"","","","","","","",""]
["\n",{"$f":"IF(Portfolio!C283=0,\"\",Portfolio!C283)","v":""},"","","","","","","",""]
["\n",{"$f":"IF(Portfolio!C284=0,\"\",Portfolio!C284)","v":""},"","","","","","","",""]
["\n",{"$f":"IF(Portfolio!C285=0,\"\",Portfolio!C285)","v":""},"","","","","","","",""]
["\n",{"$f":"IF(Portfolio!C286=0,\"\",Portfolio!C286)","v":""},"","","","","","","",""]
["\n",{"$f":"IF(Portfolio!C287=0,\"\",Portfolio!C287)","v":""},"","","","","","","",""]
["\n",{"$f":"IF(Portfolio!C288=0,\"\",Portfolio!C288)","v":""},"","","","","","","",""]
["\n",{"$f":"IF(Portfolio!C289=0,\"\",Portfolio!C289)","v":""},"","","","","","","",""]
["\n",{"$f":"IF(Portfolio!C290=0,\"\",Portfolio!C290)","v":""},"","","","","","","",""]
["\n",{"$f":"IF(Portfolio!C291=0,\"\",Portfolio!C291)","v":""},"","","","","","","",""]
["\n",{"$f":"IF(Portfolio!C292=0,\"\",Portfolio!C292)","v":""},"","","","","","","",""]
["\n",{"$f":"IF(Portfolio!C293=0,\"\",Portfolio!C293)","v":""},"","","","","","","",""]
["\n",{"$f":"IF(Portfolio!C294=0,\"\",Portfolio!C294)","v":""},"","","","","","","",""]
["\n",{"$f":"IF(Portfolio!C295=0,\"\",Portfolio!C295)","v":""},"","","","","","","",""]
["\n",{"$f":"IF(Portfolio!C296=0,\"\",Portfolio!C296)","v":""},"","","","","","","",""]
["\n",{"$f":"IF(Portfolio!C297=0,\"\",Portfolio!C297)","v":""},"","","","","","","",""]
["\n",{"$f":"IF(Portfolio!C298=0,\"\",Portfolio!C298)","v":""},"","","","","","","",""]
["\n",{"$f":"IF(Portfolio!C299=0,\"\",Portfolio!C299)","v":""},"","","","","","","",""]
["\n",{"$f":"IF(Portfolio!C300=0,\"\",Portfolio!C300)","v":""},"","","","","","","",""]
["\n",{"$f":"IF(Portfolio!C301=0,\"\",Portfolio!C301)","v":""},"","","","","","","",""]
["\n",{"$f":"IF(Portfolio!C302=0,\"\",Portfolio!C302)","v":""},"","","","","","","",""]
["\n",{"$f":"IF(Portfolio!C303=0,\"\",Portfolio!C303)","v":""},"","","","","","","",""]
["\n",{"$f":"IF(Portfolio!C304=0,\"\",Portfolio!C304)","v":""},"","","","","","","",""]
["\n",{"$f":"IF(Portfolio!C305=0,\"\",Portfolio!C305)","v":""},"","","","","","","",""]
["\n",{"$f":"IF(Portfolio!C306=0,\"\",Portfolio!C306)","v":""},"","","","","","","",""]
["\n",{"$f":"IF(Portfolio!C307=0,\"\",Portfolio!C307)","v":""},"","","","","","","",""]
["\n",{"$f":"IF(Portfolio!C308=0,\"\",Portfolio!C308)","v":""},"","","","","","","",""]
["\n",{"$f":"IF(Portfolio!C309=0,\"\",Portfolio!C309)","v":""},"","","","","","","",""]
["\n",{"$f":"IF(Portfolio!C310=0,\"\",Portfolio!C310)","v":""},"","","","","","","",""]
["\n",{"$f":"IF(Portfolio!C311=0,\"\",Portfolio!C311)","v":""},"","","","","","","",""]
["\n",{"$f":"IF(Portfolio!C312=0,\"\",Portfolio!C312)","v":""},"","","","","","","",""]
["\n",{"$f":"IF(Portfolio!C313=0,\"\",Portfolio!C313)","v":""},"","","","","","","",""]
["\n",{"$f":"IF(Portfolio!C314=0,\"\",Portfolio!C314)","v":""},"","","","","","","",""]
["\n",{"$f":"IF(Portfolio!C315=0,\"\",Portfolio!C315)","v":""},"","","","","","","",""]
["\n",{"$f":"IF(Portfolio!C316=0,\"\",Portfolio!C316)","v":""},"","","","","","","",""]
["\n",{"$f":"IF(Portfolio!C317=0,\"\",Portfolio!C317)","v":""},"","","","","","","",""]
["\n",{"$f":"IF(Portfolio!C318=0,\"\",Portfolio!C318)","v":""},"","","","","","","",""]
["\n",{"$f":"IF(Portfolio!C319=0,\"\",Portfolio!C319)","v":""},"","","","","","","",""]
["\n",{"$f":"IF(Portfolio!C320=0,\"\",Portfolio!C320)","v":""},"","","","","","","",""]
["\n",{"$f":"IF(Portfolio!C321=0,\"\",Portfolio!C321)","v":""},"","","","","","","",""]
["\n",{"$f":"IF(Portfolio!C322=0,\"\",Portfolio!C322)","v":""},"","","","","","","",""]
["\n",{"$f":"IF(Portfolio!C323=0,\"\",Portfolio!C323)","v":""},"","","","","","","",""]
["\n",{"$f":"IF(Portfolio!C324=0,\"\",Portfolio!C324)","v":""},"","","","","","","",""]
["\n",{"$f":"IF(Portfolio!C325=0,\"\",Portfolio!C325)","v":""},"","","","","","","",""]
["\n",{"$f":"IF(Portfolio!C326=0,\"\",Portfolio!C326)","v":""},"","","","","","","",""]
["\n",{"$f":"IF(Portfolio!C327=0,\"\",Portfolio!C327)","v":""},"","","","","","","",""]
["\n",{"$f":"IF(Portfolio!C328=0,\"\",Portfolio!C328)","v":""},"","","","","","","",""]
["\n",{"$f":"IF(Portfolio!C329=0,\"\",Portfolio!C329)","v":""},"","","","","","","",""]
["\n",{"$f":"IF(Portfolio!C330=0,\"\",Portfolio!C330)","v":""},"","","","","","","",""]
["\n",{"$f":"IF(Portfolio!C331=0,\"\",Portfolio!C331)","v":""},"","","","","","","",""]
[{"$f":"GetName($B323)","v":"\n"},{"$f":"IF(Portfolio!C332=0,\"\",Portfolio!C332)","v":""},{"$f":"IF($B323<>\"\",HYPERLINK(\"http://ichart.finance.yahoo.com/c/3m/\"&$B323&\"?1234\",\"3m\"),\"\")","v":""},{"$f":"IF($B323<>\"\",HYPERLINK(\"http://ichart.finance.yahoo.com/c/6m/\"&$B323&\"?1234\",\"6m\"),\"\")","v":""},{"$f":"IF($B323<>\"\",HYPERLINK(\"http://ichart.finance.yahoo.com/c/1y/\"&$B323&\"?1234\",\"1y\"),\"\")","v":""},{"$f":"IF($B323<>\"\",HYPERLINK(\"http://ichart.finance.yahoo.com/c/2y/\"&$B323&\"?1234\",\"2y\"),\"\")","v":""},{"$f":"IF($B323<>\"\",HYPERLINK(\"http://ichart.finance.yahoo.com/c/5y/\"&$B323&\"?1234\",\"5y\"),\"\")","v":""},{"$f":"IF($B323<>\"\",HYPERLINK(\"http://stockcharts.com/h-sc/ui?s=\"&$B323,\"6m\"),\"\")","v":""},{"$f":"IF($B323<>\"\",HYPERLINK(\"http://finance.yahoo.com/q?s=\"&$B323&\"&ql=0\", \"News\"),\"\")","v":""},{"$f":"IF($B323<>\"\",HYPERLINK(\"http://finance.yahoo.com/q/ks?s=\"&$B323&\"+Key+Statistics\",\"Key Stats\"),\"\")","v":""}]
["\n",{"$f":"IF(Portfolio!C333=0,\"\",Portfolio!C333)","v":""},"","","","","","","",""]
["\n",{"$f":"IF(Portfolio!C334=0,\"\",Portfolio!C334)","v":""},"","","","","","","",""]
["\n",{"$f":"IF(Portfolio!C335=0,\"\",Portfolio!C335)","v":""},"","","","","","","",""]
["\n",{"$f":"IF(Portfolio!C336=0,\"\",Portfolio!C336)","v":""},"","","","","","","",""]
["\n",{"$f":"IF(Portfolio!C337=0,\"\",Portfolio!C337)","v":""},"","","","","","","",""]
["\n",{"$f":"IF(Portfolio!C338=0,\"\",Portfolio!C338)","v":""},"","","","","","","",""]
["\n",{"$f":"IF(Portfolio!C339=0,\"\",Portfolio!C339)","v":""},"","","","","","","",""]
["\n",{"$f":"IF(Portfolio!C340=0,\"\",Portfolio!C340)","v":""},"","","","","","","",""]
["\n",{"$f":"IF(Portfolio!C341=0,\"\",Portfolio!C341)","v":""},"","","","","","","",""]
["\n",{"$f":"IF(Portfolio!C342=0,\"\",Portfolio!C342)","v":""},"","","","","","","",""]
["\n",{"$f":"IF(Portfolio!C343=0,\"\",Portfolio!C343)","v":""},"","","","","","","",""]
["\n",{"$f":"IF(Portfolio!C344=0,\"\",Portfolio!C344)","v":""},"","","","","","","",""]
["\n",{"$f":"IF(Portfolio!C345=0,\"\",Portfolio!C345)","v":""},"","","","","","","",""]
["\n",{"$f":"IF(Portfolio!C346=0,\"\",Portfolio!C346)","v":""},"","","","","","","",""]
["\n",{"$f":"IF(Portfolio!C347=0,\"\",Portfolio!C347)","v":""},"","","","","","","",""]
["\n",{"$f":"IF(Portfolio!C348=0,\"\",Portfolio!C348)","v":""},"","","","","","","",""]
["\n",{"$f":"IF(Portfolio!C349=0,\"\",Portfolio!C349)","v":""},"","","","","","","",""]
["\n",{"$f":"IF(Portfolio!C350=0,\"\",Portfolio!C350)","v":""},"","","","","","","",""]
["\n",{"$f":"IF(Portfolio!C351=0,\"\",Portfolio!C351)","v":""},"","","","","","","",""]
["\n",{"$f":"IF(Portfolio!C352=0,\"\",Portfolio!C352)","v":""},"","","","","","","",""]
["\n",{"$f":"IF(Portfolio!C353=0,\"\",Portfolio!C353)","v":""},"","","","","","","",""]
["\n",{"$f":"IF(Portfolio!C354=0,\"\",Portfolio!C354)","v":""},"","","","","","","",""]
["\n",{"$f":"IF(Portfolio!C355=0,\"\",Portfolio!C355)","v":""},"","","","","","","",""]
["\n",{"$f":"IF(Portfolio!C356=0,\"\",Portfolio!C356)","v":""},"","","","","","","",""]
["\n",{"$f":"IF(Portfolio!C357=0,\"\",Portfolio!C357)","v":""},"","","","","","","",""]
["\n",{"$f":"IF(Portfolio!C358=0,\"\",Portfolio!C358)","v":""},"","","","","","","",""]
["\n",{"$f":"IF(Portfolio!C359=0,\"\",Portfolio!C359)","v":""},"","","","","","","",""]
["\n",{"$f":"IF(Portfolio!C360=0,\"\",Portfolio!C360)","v":""},"","","","","","","",""]
["\n",{"$f":"IF(Portfolio!C361=0,\"\",Portfolio!C361)","v":""},"","","","","","","",""]
["\n",{"$f":"IF(Portfolio!C362=0,\"\",Portfolio!C362)","v":""},"","","","","","","",""]
["\n",{"$f":"IF(Portfolio!C363=0,\"\",Portfolio!C363)","v":""},"","","","","","","",""]
["\n",{"$f":"IF(Portfolio!C364=0,\"\",Portfolio!C364)","v":""},"","","","","","","",""]
["\n",{"$f":"IF(Portfolio!C365=0,\"\",Portfolio!C365)","v":""},"","","","","","","",""]
["\n",{"$f":"IF(Portfolio!C366=0,\"\",Portfolio!C366)","v":""},"","","","","","","",""]
["\n",{"$f":"IF(Portfolio!C367=0,\"\",Portfolio!C367)","v":""},"","","","","","","",""]
["\n",{"$f":"IF(Portfolio!C368=0,\"\",Portfolio!C368)","v":""},"","","","","","","",""]
["\n",{"$f":"IF(Portfolio!C369=0,\"\",Portfolio!C369)","v":""},"","","","","","","",""]
["\n",{"$f":"IF(Portfolio!C370=0,\"\",Portfolio!C370)","v":""},"","","","","","","",""]
["\n",{"$f":"IF(Portfolio!C371=0,\"\",Portfolio!C371)","v":""},"","","","","","","",""]
["\n",{"$f":"IF(Portfolio!C372=0,\"\",Portfolio!C372)","v":""},"","","","","","","",""]
["\n",{"$f":"IF(Portfolio!C373=0,\"\",Portfolio!C373)","v":""},"","","","","","","",""]
["\n",{"$f":"IF(Portfolio!C374=0,\"\",Portfolio!C374)","v":""},"","","","","","","",""]
["\n",{"$f":"IF(Portfolio!C375=0,\"\",Portfolio!C375)","v":""},"","","","","","","",""]
["\n",{"$f":"IF(Portfolio!C376=0,\"\",Portfolio!C376)","v":""},"","","","","","","",""]
["\n",{"$f":"IF(Portfolio!C377=0,\"\",Portfolio!C377)","v":""},"","","","","","","",""]
["\n",{"$f":"IF(Portfolio!C378=0,\"\",Portfolio!C378)","v":""},"","","","","","","",""]
["\n",{"$f":"IF(Portfolio!C379=0,\"\",Portfolio!C379)","v":""},"","","","","","","",""]
["\n",{"$f":"IF(Portfolio!C380=0,\"\",Portfolio!C380)","v":""},"","","","","","","",""]
["\n",{"$f":"IF(Portfolio!C381=0,\"\",Portfolio!C381)","v":""},"","","","","","","",""]
["\n",{"$f":"IF(Portfolio!C382=0,\"\",Portfolio!C382)","v":""},"","","","","","","",""]
["\n",{"$f":"IF(Portfolio!C383=0,\"\",Portfolio!C383)","v":""},"","","","","","","",""]
["\n",{"$f":"IF(Portfolio!C384=0,\"\",Portfolio!C384)","v":""},"","","","","","","",""]
["\n",{"$f":"IF(Portfolio!C385=0,\"\",Portfolio!C385)","v":""},"","","","","","","",""]
["\n",{"$f":"IF(Portfolio!C386=0,\"\",Portfolio!C386)","v":""},"","","","","","","",""]
["\n",{"$f":"IF(Portfolio!C387=0,\"\",Portfolio!C387)","v":""},"","","","","","","",""]
["\n",{"$f":"IF(Portfolio!C388=0,\"\",Portfolio!C388)","v":""},"","","","","","","",""]
["\n",{"$f":"IF(Portfolio!C389=0,\"\",Portfolio!C389)","v":""},"","","","","","","",""]
["\n",{"$f":"IF(Portfolio!C390=0,\"\",Portfolio!C390)","v":""},"","","","","","","",""]
["\n",{"$f":"IF(Portfolio!C391=0,\"\",Portfolio!C391)","v":""},"","","","","","","",""]
["\n",{"$f":"IF(Portfolio!C392=0,\"\",Portfolio!C392)","v":""},"","","","","","","",""]
["\n",{"$f":"IF(Portfolio!C393=0,\"\",Portfolio!C393)","v":""},"","","","","","","",""]
["\n",{"$f":"IF(Portfolio!C394=0,\"\",Portfolio!C394)","v":""},"","","","","","","",""]
["\n",{"$f":"IF(Portfolio!C395=0,\"\",Portfolio!C395)","v":""},"","","","","","","",""]
[{"$f":"GetName($B387)","v":"\n"},{"$f":"IF(Portfolio!C396=0,\"\",Portfolio!C396)","v":""},{"$f":"IF($B387<>\"\",HYPERLINK(\"http://ichart.finance.yahoo.com/c/3m/\"&$B387&\"?1234\",\"3m\"),\"\")","v":""},{"$f":"IF($B387<>\"\",HYPERLINK(\"http://ichart.finance.yahoo.com/c/6m/\"&$B387&\"?1234\",\"6m\"),\"\")","v":""},{"$f":"IF($B387<>\"\",HYPERLINK(\"http://ichart.finance.yahoo.com/c/1y/\"&$B387&\"?1234\",\"1y\"),\"\")","v":""},{"$f":"IF($B387<>\"\",HYPERLINK(\"http://ichart.finance.yahoo.com/c/2y/\"&$B387&\"?1234\",\"2y\"),\"\")","v":""},{"$f":"IF($B387<>\"\",HYPERLINK(\"http://ichart.finance.yahoo.com/c/5y/\"&$B387&\"?1234\",\"5y\"),\"\")","v":""},{"$f":"IF($B387<>\"\",HYPERLINK(\"http://stockcharts.com/h-sc/ui?s=\"&$B387,\"6m\"),\"\")","v":""},{"$f":"IF($B387<>\"\",HYPERLINK(\"http://finance.yahoo.com/q?s=\"&$B387&\"&ql=0\", \"News\"),\"\")","v":""},{"$f":"IF($B387<>\"\",HYPERLINK(\"http://finance.yahoo.com/q/ks?s=\"&$B387&\"+Key+Statistics\",\"Key Stats\"),\"\")","v":""}]
["\n",{"$f":"IF(Portfolio!C397=0,\"\",Portfolio!C397)","v":""},"","","","","","","",""]
["\n",{"$f":"IF(Portfolio!C398=0,\"\",Portfolio!C398)","v":""},"","","","","","","",""]
["\n",{"$f":"IF(Portfolio!C399=0,\"\",Portfolio!C399)","v":""},"","","","","","","",""]
["\n",{"$f":"IF(Portfolio!C400=0,\"\",Portfolio!C400)","v":""},"","","","","","","",""]
["\n",{"$f":"IF(Portfolio!C401=0,\"\",Portfolio!C401)","v":""},"","","","","","","",""]
["\n",{"$f":"IF(Portfolio!C402=0,\"\",Portfolio!C402)","v":""},"","","","","","","",""]
["\n",{"$f":"IF(Portfolio!C403=0,\"\",Portfolio!C403)","v":""},"","","","","","","",""]
["\n",{"$f":"IF(Portfolio!C404=0,\"\",Portfolio!C404)","v":""},"","","","","","","",""]
["\n",{"$f":"IF(Portfolio!C405=0,\"\",Portfolio!C405)","v":""},"","","","","","","",""]
["\n",{"$f":"IF(Portfolio!C406=0,\"\",Portfolio!C406)","v":""},"","","","","","","",""]
["\n",{"$f":"IF(Portfolio!C407=0,\"\",Portfolio!C407)","v":""},"","","","","","","",""]
["\n",{"$f":"IF(Portfolio!C408=0,\"\",Portfolio!C408)","v":""},"","","","","","","",""]
["\n",{"$f":"IF(Portfolio!C409=0,\"\",Portfolio!C409)","v":""},"","","","","","","",""]
["\n",{"$f":"IF(Portfolio!C410=0,\"\",Portfolio!C410)","v":""},"","","","","","","",""]
["\n",{"$f":"IF(Portfolio!C411=0,\"\",Portfolio!C411)","v":""},"","","","","","","",""]
["\n",{"$f":"IF(Portfolio!C412=0,\"\",Portfolio!C412)","v":""},"","","","","","","",""]
["\n",{"$f":"IF(Portfolio!C413=0,\"\",Portfolio!C413)","v":""},"","","","","","","",""]
["\n",{"$f":"IF(Portfolio!C414=0,\"\",Portfolio!C414)","v":""},"","","","","","","",""]
["\n",{"$f":"IF(Portfolio!C415=0,\"\",Portfolio!C415)","v":""},"","","","","","","",""]
["\n",{"$f":"IF(Portfolio!C416=0,\"\",Portfolio!C416)","v":""},"","","","","","","",""]
["\n",{"$f":"IF(Portfolio!C417=0,\"\",Portfolio!C417)","v":""},"","","","","","","",""]
["\n",{"$f":"IF(Portfolio!C418=0,\"\",Portfolio!C418)","v":""},"","","","","","","",""]
["\n",{"$f":"IF(Portfolio!C419=0,\"\",Portfolio!C419)","v":""},"","","","","","","",""]
["\n",{"$f":"IF(Portfolio!C420=0,\"\",Portfolio!C420)","v":""},"","","","","","","",""]
["\n",{"$f":"IF(Portfolio!C421=0,\"\",Portfolio!C421)","v":""},"","","","","","","",""]
["\n",{"$f":"IF(Portfolio!C422=0,\"\",Portfolio!C422)","v":""},"","","","","","","",""]
["\n",{"$f":"IF(Portfolio!C423=0,\"\",Portfolio!C423)","v":""},"","","","","","","",""]
["\n",{"$f":"IF(Portfolio!C424=0,\"\",Portfolio!C424)","v":""},"","","","","","","",""]
["\n",{"$f":"IF(Portfolio!C425=0,\"\",Portfolio!C425)","v":""},"","","","","","","",""]
["\n",{"$f":"IF(Portfolio!C426=0,\"\",Portfolio!C426)","v":""},"","","","","","","",""]
["\n",{"$f":"IF(Portfolio!C427=0,\"\",Portfolio!C427)","v":""},"","","","","","","",""]
["\n",{"$f":"IF(Portfolio!C428=0,\"\",Portfolio!C428)","v":""},"","","","","","","",""]
["\n",{"$f":"IF(Portfolio!C429=0,\"\",Portfolio!C429)","v":""},"","","","","","","",""]
["\n",{"$f":"IF(Portfolio!C430=0,\"\",Portfolio!C430)","v":""},"","","","","","","",""]
["\n",{"$f":"IF(Portfolio!C431=0,\"\",Portfolio!C431)","v":""},"","","","","","","",""]
["\n",{"$f":"IF(Portfolio!C432=0,\"\",Portfolio!C432)","v":""},"","","","","","","",""]
["\n",{"$f":"IF(Portfolio!C433=0,\"\",Portfolio!C433)","v":""},"","","","","","","",""]
["\n",{"$f":"IF(Portfolio!C434=0,\"\",Portfolio!C434)","v":""},"","","","","","","",""]
["\n",{"$f":"IF(Portfolio!C435=0,\"\",Portfolio!C435)","v":""},"","","","","","","",""]
["\n",{"$f":"IF(Portfolio!C436=0,\"\",Portfolio!C436)","v":""},"","","","","","","",""]
["\n",{"$f":"IF(Portfolio!C437=0,\"\",Portfolio!C437)","v":""},"","","","","","","",""]
["\n",{"$f":"IF(Portfolio!C438=0,\"\",Portfolio!C438)","v":""},"","","","","","","",""]
["\n",{"$f":"IF(Portfolio!C439=0,\"\",Portfolio!C439)","v":""},"","","","","","","",""]
["\n",{"$f":"IF(Portfolio!C440=0,\"\",Portfolio!C440)","v":""},"","","","","","","",""]
["\n",{"$f":"IF(Portfolio!C441=0,\"\",Portfolio!C441)","v":""},"","","","","","","",""]
["\n",{"$f":"IF(Portfolio!C442=0,\"\",Portfolio!C442)","v":""},"","","","","","","",""]
["\n",{"$f":"IF(Portfolio!C443=0,\"\",Portfolio!C443)","v":""},"","","","","","","",""]
["\n",{"$f":"IF(Portfolio!C444=0,\"\",Portfolio!C444)","v":""},"","","","","","","",""]
["\n",{"$f":"IF(Portfolio!C445=0,\"\",Portfolio!C445)","v":""},"","","","","","","",""]
["\n",{"$f":"IF(Portfolio!C446=0,\"\",Portfolio!C446)","v":""},"","","","","","","",""]
["\n",{"$f":"IF(Portfolio!C447=0,\"\",Portfolio!C447)","v":""},"","","","","","","",""]
["\n",{"$f":"IF(Portfolio!C448=0,\"\",Portfolio!C448)","v":""},"","","","","","","",""]
["\n",{"$f":"IF(Portfolio!C449=0,\"\",Portfolio!C449)","v":""},"","","","","","","",""]
["\n",{"$f":"IF(Portfolio!C450=0,\"\",Portfolio!C450)","v":""},"","","","","","","",""]
["\n",{"$f":"IF(Portfolio!C451=0,\"\",Portfolio!C451)","v":""},"","","","","","","",""]
["\n",{"$f":"IF(Portfolio!C452=0,\"\",Portfolio!C452)","v":""},"","","","","","","",""]
["\n",{"$f":"IF(Portfolio!C453=0,\"\",Portfolio!C453)","v":""},"","","","","","","",""]
["\n",{"$f":"IF(Portfolio!C454=0,\"\",Portfolio!C454)","v":""},"","","","","","","",""]
["\n",{"$f":"IF(Portfolio!C455=0,\"\",Portfolio!C455)","v":""},"","","","","","","",""]
["\n",{"$f":"IF(Portfolio!C456=0,\"\",Portfolio!C456)","v":""},"","","","","","","",""]
["\n",{"$f":"IF(Portfolio!C457=0,\"\",Portfolio!C457)","v":""},"","","","","","","",""]
["\n",{"$f":"IF(Portfolio!C458=0,\"\",Portfolio!C458)","v":""},"","","","","","","",""]
["\n",{"$f":"IF(Portfolio!C459=0,\"\",Portfolio!C459)","v":""},"","","","","","","",""]
[{"$f":"GetName($B451)","v":"\n"},{"$f":"IF(Portfolio!C460=0,\"\",Portfolio!C460)","v":""},{"$f":"IF($B451<>\"\",HYPERLINK(\"http://ichart.finance.yahoo.com/c/3m/\"&$B451&\"?1234\",\"3m\"),\"\")","v":""},{"$f":"IF($B451<>\"\",HYPERLINK(\"http://ichart.finance.yahoo.com/c/6m/\"&$B451&\"?1234\",\"6m\"),\"\")","v":""},{"$f":"IF($B451<>\"\",HYPERLINK(\"http://ichart.finance.yahoo.com/c/1y/\"&$B451&\"?1234\",\"1y\"),\"\")","v":""},{"$f":"IF($B451<>\"\",HYPERLINK(\"http://ichart.finance.yahoo.com/c/2y/\"&$B451&\"?1234\",\"2y\"),\"\")","v":""},{"$f":"IF($B451<>\"\",HYPERLINK(\"http://ichart.finance.yahoo.com/c/5y/\"&$B451&\"?1234\",\"5y\"),\"\")","v":""},{"$f":"IF($B451<>\"\",HYPERLINK(\"http://stockcharts.com/h-sc/ui?s=\"&$B451,\"6m\"),\"\")","v":""},{"$f":"IF($B451<>\"\",HYPERLINK(\"http://finance.yahoo.com/q?s=\"&$B451&\"&ql=0\", \"News\"),\"\")","v":""},{"$f":"IF($B451<>\"\",HYPERLINK(\"http://finance.yahoo.com/q/ks?s=\"&$B451&\"+Key+Statistics\",\"Key Stats\"),\"\")","v":""}]
["\n",{"$f":"IF(Portfolio!C461=0,\"\",Portfolio!C461)","v":""},"","","","","","","",""]
["\n",{"$f":"IF(Portfolio!C462=0,\"\",Portfolio!C462)","v":""},"","","","","","","",""]
["\n",{"$f":"IF(Portfolio!C463=0,\"\",Portfolio!C463)","v":""},"","","","","","","",""]
["\n",{"$f":"IF(Portfolio!C464=0,\"\",Portfolio!C464)","v":""},"","","","","","","",""]
["\n",{"$f":"IF(Portfolio!C465=0,\"\",Portfolio!C465)","v":""},"","","","","","","",""]
["\n",{"$f":"IF(Portfolio!C466=0,\"\",Portfolio!C466)","v":""},"","","","","","","",""]
["\n",{"$f":"IF(Portfolio!C467=0,\"\",Portfolio!C467)","v":""},"","","","","","","",""]
["\n",{"$f":"IF(Portfolio!C468=0,\"\",Portfolio!C468)","v":""},"","","","","","","",""]
["\n",{"$f":"IF(Portfolio!C469=0,\"\",Portfolio!C469)","v":""},"","","","","","","",""]
["\n",{"$f":"IF(Portfolio!C470=0,\"\",Portfolio!C470)","v":""},"","","","","","","",""]
["\n",{"$f":"IF(Portfolio!C471=0,\"\",Portfolio!C471)","v":""},"","","","","","","",""]
["\n",{"$f":"IF(Portfolio!C472=0,\"\",Portfolio!C472)","v":""},"","","","","","","",""]
["\n",{"$f":"IF(Portfolio!C473=0,\"\",Portfolio!C473)","v":""},"","","","","","","",""]
["\n",{"$f":"IF(Portfolio!C474=0,\"\",Portfolio!C474)","v":""},"","","","","","","",""]
["\n",{"$f":"IF(Portfolio!C475=0,\"\",Portfolio!C475)","v":""},"","","","","","","",""]
["\n",{"$f":"IF(Portfolio!C476=0,\"\",Portfolio!C476)","v":""},"","","","","","","",""]
["\n",{"$f":"IF(Portfolio!C477=0,\"\",Portfolio!C477)","v":""},"","","","","","","",""]
["\n",{"$f":"IF(Portfolio!C478=0,\"\",Portfolio!C478)","v":""},"","","","","","","",""]
["\n",{"$f":"IF(Portfolio!C479=0,\"\",Portfolio!C479)","v":""},"","","","","","","",""]
["\n",{"$f":"IF(Portfolio!C480=0,\"\",Portfolio!C480)","v":""},"","","","","","","",""]
["\n",{"$f":"IF(Portfolio!C481=0,\"\",Portfolio!C481)","v":""},"","","","","","","",""]
["\n",{"$f":"IF(Portfolio!C482=0,\"\",Portfolio!C482)","v":""},"","","","","","","",""]
["\n",{"$f":"IF(Portfolio!C483=0,\"\",Portfolio!C483)","v":""},"","","","","","","",""]
["\n",{"$f":"IF(Portfolio!C484=0,\"\",Portfolio!C484)","v":""},"","","","","","","",""]
["\n",{"$f":"IF(Portfolio!C485=0,\"\",Portfolio!C485)","v":""},"","","","","","","",""]
["\n",{"$f":"IF(Portfolio!C486=0,\"\",Portfolio!C486)","v":""},"","","","","","","",""]
["\n",{"$f":"IF(Portfolio!C487=0,\"\",Portfolio!C487)","v":""},"","","","","","","",""]
["\n",{"$f":"IF(Portfolio!C488=0,\"\",Portfolio!C488)","v":""},"","","","","","","",""]
["\n",{"$f":"IF(Portfolio!C489=0,\"\",Portfolio!C489)","v":""},"","","","","","","",""]
["\n",{"$f":"IF(Portfolio!C490=0,\"\",Portfolio!C490)","v":""},"","","","","","","",""]
["\n",{"$f":"IF(Portfolio!C491=0,\"\",Portfolio!C491)","v":""},"","","","","","","",""]
["\n",{"$f":"IF(Portfolio!C492=0,\"\",Portfolio!C492)","v":""},"","","","","","","",""]
["\n",{"$f":"IF(Portfolio!C493=0,\"\",Portfolio!C493)","v":""},"","","","","","","",""]
["\n",{"$f":"IF(Portfolio!C494=0,\"\",Portfolio!C494)","v":""},"","","","","","","",""]
["\n",{"$f":"IF(Portfolio!C495=0,\"\",Portfolio!C495)","v":""},"","","","","","","",""]
["\n",{"$f":"IF(Portfolio!C496=0,\"\",Portfolio!C496)","v":""},"","","","","","","",""]
["\n",{"$f":"IF(Portfolio!C497=0,\"\",Portfolio!C497)","v":""},"","","","","","","",""]
["\n",{"$f":"IF(Portfolio!C498=0,\"\",Portfolio!C498)","v":""},"","","","","","","",""]
["\n",{"$f":"IF(Portfolio!C499=0,\"\",Portfolio!C499)","v":""},"","","","","","","",""]
["\n",{"$f":"IF(Portfolio!C500=0,\"\",Portfolio!C500)","v":""},"","","","","","","",""]
["\n",{"$f":"IF(Portfolio!C501=0,\"\",Portfolio!C501)","v":""},"","","","","","","",""]
["\n",{"$f":"IF(Portfolio!C502=0,\"\",Portfolio!C502)","v":""},"","","","","","","",""]
["\n",{"$f":"IF(Portfolio!C503=0,\"\",Portfolio!C503)","v":""},"","","","","","","",""]
["\n",{"$f":"IF(Portfolio!C504=0,\"\",Portfolio!C504)","v":""},"","","","","","","",""]
["\n",{"$f":"IF(Portfolio!C505=0,\"\",Portfolio!C505)","v":""},"","","","","","","",""]
["\n",{"$f":"IF(Portfolio!C506=0,\"\",Portfolio!C506)","v":""},"","","","","","","",""]
["\n",{"$f":"IF(Portfolio!C507=0,\"\",Portfolio!C507)","v":""},"","","","","","","",""]
["\n",{"$f":"IF(Portfolio!C508=0,\"\",Portfolio!C508)","v":""},"","","","","","","",""]
["\n",{"$f":"IF(Portfolio!C509=0,\"\",Portfolio!C509)","v":""},"","","","","","","",""]
["\n",{"$f":"IF(Portfolio!C510=0,\"\",Portfolio!C510)","v":""},"","","","","","","",""]
["\n",{"$f":"IF(Portfolio!C511=0,\"\",Portfolio!C511)","v":""},"","","","","","","",""]
[{"$error":"#VALUE!"},{"$f":"IF(Portfolio!#REF!=0,\"\",Portfolio!#REF!)","v":{"$error":"#REF!"}},{"$error":"#REF!"},{"$error":"#REF!"},{"$error":"#REF!"},{"$error":"#REF!"},{"$error":"#REF!"},{"$error":"#REF!"},{"$error":"#REF!"},{"$error":"#REF!"}]
["\n",{"$f":"IF(Portfolio!C512=0,\"\",Portfolio!C512)","v":""},"","","","","","","",""]
["\n",{"$f":"IF(Portfolio!C513=0,\"\",Portfolio!C513)","v":""},"","","","","","","",""]
["\n",{"$f":"IF(Portfolio!C514=0,\"\",Portfolio!C514)","v":""},"","","","","","","",""]
["\n",{"$f":"IF(Portfolio!C515=0,\"\",Portfolio!C515)","v":""},"","","","","","","",""]
["\n",{"$f":"IF(Portfolio!C516=0,\"\",Portfolio!C516)","v":""},"","","","","","","",""]
["\n",{"$f":"IF(Portfolio!C517=0,\"\",Portfolio!C517)","v":""},"","","","","","","",""]
["\n",{"$f":"IF(Portfolio!C518=0,\"\",Portfolio!C518)","v":""},"","","","","","","",""]
["\n",{"$f":"IF(Portfolio!C519=0,\"\",Portfolio!C519)","v":""},"","","","","","","",""]

{"sheet":"Settings","index":2,"n_rows":3,"n_cols":2,"rows_kept":3,"cut":false,"hidden":false,"merged":[[0,0,0,1]]}
["Formula Variable Settings"]
["Alert SELL Percentage Gain Limit",0.2]
["Alert STOP Trailing Percentage Loss Limit",0.04]

{"sheet":"Exchanges","index":3,"n_rows":159,"n_cols":5,"rows_kept":159,"cut":false,"hidden":false,"merged":[[69,0,69,2]]}
["Exchanges and Yahoo"]
[]
["Add the listed Suffix to your symbol name to get a quote from a specific exchange (N/A means no suffix)"]
[]
["Country","Exchange","Suffix","Delay","Data Provider"]
["United States of America","American Stock Exchange","N/A","15 min","Direct from Exchange"]
["United States of America","BATS Exchange","N/A","Real-time","Direct from Exchange"]
["United States of America","Chicago Board of Trade",".CBT","10 min","Interactive Data Real-Time Services"]
["United States of America","Chicago Mercantile Exchange",".CME","10 min","Interactive Data Real-Time Services"]
["United States of America","Dow Jones Indexes","N/A","Real-time","Interactive Data Real-Time Services"]
["United States of America","NASDAQ Stock Exchange","N/A","15 min","Direct from Exchange"]
["United States of America","New York Board of Trade",".NYB","30 min","Interactive Data Real-Time Services"]
["United States of America","New York Commodities Exchange",".CMX","30 min","Interactive Data Real-Time Services"]
["United States of America","New York Mercantile Exchange",".NYM","30 min","Interactive Data Real-Time Services"]
["United States of America","New York Stock Exchange","N/A","15 min","Direct from Exchange"]
["United States of America","OTC Bulletin Board Market",".OB","20 min","Direct from Exchange"]
["United States of America","Pink Sheets",".PK","15 min","Direct from Exchange"]
["United States of America","S & P Indices","N/A","Real-time","Interactive Data Real-Time Services"]
["Argentina","Buenos Aires Stock Exchange",".BA","30 min","Interactive Data Real-Time Services"]
["Austria","Vienna Stock Exchange",".VI","15 min","Telekurs"]
["Australia","Australian Stock Exchange",".AX","20 min","Interactive Data Real-Time Services"]
["Belgium","Brussels Stocks",".BR","15 min"]
["Brazil","BOVESPA – Sao Paolo Stock Exchange",".SA","15 min","Interactive Data Real-Time Services"]
["Canada","Toronto Stock Exchange",".TO","15 min","Interactive Data Real-Time Services"]
["Canada","TSX Venture Exchange",".V","15 min","Interactive Data Real-Time Services"]
["Chile","Santiago Stock Exchange",".SN","15 min","Interactive Data Real-Time Services"]
["China","Shanghai Stock Exchange",".SS","30 min","Interactive Data Real-Time Services"]
["China","Shenzhen Stock Exchange",".SZ","30 min","Interactive Data Real-Time Services"]
["Denmark","Copenhagen Stock Exchange",".CO","15 min","Telekurs"]
["France","Euronext",".NX","15 min","Telekurs"]
["France","Paris Stock Exchange",".PA","15 min","Telekurs"]
["Germany","Berlin Stock Exchange",".BE","15 min","Telekurs"]
["Germany","Bremen Stock Exchange",".BM","15 min","Telekurs"]
["Germany","Dusseldorf Stock Exchange",".DU","15 min","Telekurs"]
["Germany","Frankfurt Stock Exchange",".F","15 min","Telekurs"]
["Germany","Hamburg Stock Exchange",".HM","15 min","Telekurs"]
["Germany","Hanover Stock Exchange",".HA","15 min","Telekurs"]
["Germany","Munich Stock Exchange",".MU","15 min","Telekurs"]
["Germany","Stuttgart Stock Exchange",".SG","15 min","Telekurs"]
["Germany","XETRA Stock Exchange",".DE","15 min","Telekurs"]
["Hong Kong","Hong Kong Stock Exchange",".HK","15 min","Interactive Data Real-Time Services"]
["India","Bombay Stock Exchange",".BO","15 min","Interactive Data Real-Time Services"]
["India","National Stock Exchange of India",".NS","15 min","National Stock Exchange of India"]
["Indonesia","Jakarta Stock Exchange",".JK","10 min","Interactive Data Real-Time Services"]
["Israel","Tel Aviv Stock Exchange",".TA","20 min","Telekurs"]
["Italy","Milan Stock Exchange",".MI","20 min","Telekurs"]
["Japan","Nikkei Indices","N/A","30 min","Interactive Data Real-Time Services"]
["Mexico","Mexico Stock Exchange",".MX","20 min","Telekurs"]
["Netherlands","Amsterdam Stock Exchange",".AS","15 min","Telekurs"]
["New Zealand","New Zealand Stock Exchange",".NZ","20 min","Interactive Data Real-Time Services"]
["Norway","Oslo Stock Exchange",".OL","15 min","Telekurs"]
["Portugal","Lisbon Stocks",".LS","15 min"]
["Singapore","Singapore Stock Exchange",".SI","20 min","Interactive Data Real-Time Services"]
["South Korea","Korea Stock Exchange",".KS","20 min","Interactive Data Real-Time Services"]
["South Korea","KOSDAQ",".KQ","20 min","Interactive Data Real-Time Services"]
["Spain","Barcelona Stock Exchange",".BC","15 min","Telekurs"]
["Spain","Bilbao Stock Exchange",".BI","15 min","Telekurs"]
["Spain","Madrid Fixed Income Market",".MF","15 min","Telekurs"]
["Spain","Madrid SE C.A.T.S.",".MC","15 min","Telekurs"]
["Spain","Madrid Stock Exchange",".MA","15 min","Telekurs"]
["Sweden","Stockholm Stock Exchange",".ST","15 min","Telekurs"]
["Switzerland","Swiss Exchange",".SW","30 min","Telekurs"]
["Taiwan","Taiwan OTC Exchange",".TWO","20 min","Interactive Data Real-Time Services"]
["Taiwan","Taiwan Stock Exchange",".TW","20 min","Interactive Data Real-Time Services"]
["United Kingdom","FTSE Indices","N/A","15 min","Telekurs"]
["United Kingdom","London Stock Exchange",".L","20 min","Telekurs"]
[]
[]
["Yahoo Finance API"]
[]
["Name","Description","Tag"]
["AfterHoursChangeRealtime","After Hours Change (Realtime)","c8"]
["AnnualizedGain","Annualized Gain","g3"]
["Ask","Ask","a0"]
["AskRealtime","Ask (Realtime)","b2"]
["AskSize","Ask Size","a5"]
["AverageDailyVolume","Average Daily Volume","a2"]
["Bid","Bid","b0"]
["BidRealtime","Bid (Realtime)","b3"]
["BidSize","Bid Size","b6"]
["BookValuePerShare","Book Value Per Share","b4"]
["Change","Change","c1"]
["Change_ChangeInPercent","Change Change In Percent ","c0"]
["ChangeFromFiftydayMovingAverage","Change From Fiftyday Moving Average","m7"]
["ChangeFromTwoHundreddayMovingAverage","Change From Two Hundredday Moving Average","m5"]
["ChangeFromYearHigh","Change From Year High","k4"]
["ChangeFromYearLow","Change From Year Low","j5"]
["ChangeInPercent","Change In Percent","p2"]
["ChangeInPercentRealtime","Change In Percent (Realtime)","k2"]
["ChangeRealtime","Change (Realtime)","c6"]
["Commission","Commission","c3"]
["Currency","Currency","c4"]
["DaysHigh","Days High","h0"]
["DaysLow","Days Low","g0"]
["DaysRange","Days Range","m0"]
["DaysRangeRealtime","Days Range (Realtime)","m2"]
["DaysValueChange","Days Value Change","w1"]
["DaysValueChangeRealtime","Days Value Change (Realtime)","w4"]
["DividendPayDate","Dividend Pay Date","r1"]
["TrailingAnnualDividendYield","Trailing Annual Dividend Yield","d0"]
["TrailingAnnualDividendYieldInPercent","Trailing Annual Dividend Yield In Percent","y0"]
["DilutedEPS","Diluted E P S","e0"]
["EBITDA","E B I T D A","j4"]
["EPSEstimateCurrentYear","E P S Estimate Current Year","e7"]
["EPSEstimateNextQuarter","E P S Estimate Next Quarter","e9"]
["EPSEstimateNextYear","E P S Estimate Next Year","e8"]
["ExDividendDate","Ex Dividend Date","q0"]
["FiftydayMovingAverage","Fiftyday Moving Average","m3"]
["SharesFloat","Shares Float","f6"]
["HighLimit","High Limit","l2"]
["HoldingsGain","Holdings Gain","g4"]
["HoldingsGainPercent","Holdings Gain Percent","g1"]
["HoldingsGainPercentRealtime","Holdings Gain Percent (Realtime)","g5"]
["HoldingsGainRealtime","Holdings Gain (Realtime)","g6"]
["HoldingsValue","Holdings Value","v1"]
["HoldingsValueRealtime","Holdings Value (Realtime)","v7"]
["LastTradeDate","Last Trade Date","d1"]
["LastTradePriceOnly","Last Trade Price Only","l1",{"$f":"GetStockNumParam(\"MFC.TO\",\"l1\")","v":24.64}]
["LastTradeRealtimeWithTime","Last Trade (Realtime) With Time","k1"]
["LastTradeSize","Last Trade Size","k3"]
["LastTradeTime","Last Trade Time","t1"]
["LastTradeWithTime","Last Trade With Time","l0"]
["LowLimit","Low Limit","l3"]
["MarketCapitalization","Market Capitalization","j1"]
["MarketCapRealtime","Market Cap (Realtime)","j3"]
["MoreInfo","More Info","i0"]
["Name","Name","n0"]
["Notes","Notes","n4"]
["OneyrTargetPrice","Oneyr Target Price","t8"]
["Open","Open","o0"]
["OrderBookRealtime","Order Book (Realtime)","i5"]
["PEGRatio","P E G Ratio","r5"]
["PERatio","P E Ratio","r0"]
["PERatioRealtime","P E Ratio (Realtime)","r2"]
["PercentChangeFromFiftydayMovingAverage","Percent Change From Fiftyday Moving Average","m8"]
["PercentChangeFromTwoHundreddayMovingAverage","Percent Change From Two Hundredday Moving Average","m6"]
["ChangeInPercentFromYearHigh","Change In Percent From Year High","k5"]
["PercentChangeFromYearLow","Percent Change From Year Low","j6"]
["PreviousClose","Previous Close","p0"]
["PriceBook","Price Book","p6"]
["PriceEPSEstimateCurrentYear","Price E P S Estimate Current Year","r6"]
["PriceEPSEstimateNextYear","Price E P S Estimate Next Year","r7"]
["PricePaid","Price Paid","p1"]
["PriceSales","Price Sales","p5"]
["Revenue","Revenue","s6"]
["SharesOwned","Shares Owned","s1"]
["SharesOutstanding","Shares Outstanding","j2"]
["ShortRatio","Short Ratio","s7"]
["StockExchange","Stock Exchange","x0"]
["Symbol","Symbol","s0"]
["TickerTrend","Ticker Trend","t7"]
["TradeDate","Trade Date","d2"]
["TradeLinks","Trade Links","t6"]
["TradeLinksAdditional","Trade Links Additional","f0"]
["TwoHundreddayMovingAverage","Two Hundredday Moving Average","m4"]
["Volume","Volume","v0"]
["YearHigh","Year High","k0"]
["YearLow","Year Low","j0"]
["YearRange","Year Range","w0"]